id_mutation,date_mutation,numero_disposition,nature_mutation,valeur_fonciere,adresse_numero,adresse_suffixe,adresse_nom_voie,adresse_code_voie,code_postal,code_commune,nom_commune,code_departement,ancien_code_commune,ancien_nom_commune,id_parcelle,ancien_id_parcelle,numero_volume,lot1_numero,lot1_surface_carrez,lot2_numero,lot2_surface_carrez,lot3_numero,lot3_surface_carrez,lot4_numero,lot4_surface_carrez,lot5_numero,lot5_surface_carrez,nombre_lots,code_type_local,type_local,surface_reelle_bati,nombre_pieces_principales,code_nature_culture,nature_culture,code_nature_culture_speciale,nature_culture_speciale,surface_terrain,longitude,latitude
2019-392914,2019-01-29,000001,Vente,15000,,,LE VILLAGE,B030,30500,30247,Saint-Denis,30,,,302470000B0297,,,,,,,,,,,,,0,,,,,T,terres,,,223,4.252221,44.233274
2019-393186,2019-03-07,000001,Vente,122600,1,,PL DE LA MAIRIE,0130,30500,30247,Saint-Denis,30,,,302470000B0094,,,,,,,,,,,,,0,2,Appartement,23,1,S,sols,,,115,4.25285,44.234493
2019-393186,2019-03-07,000001,Vente,122600,1,,PL DE LA MAIRIE,0130,30500,30247,Saint-Denis,30,,,302470000B0094,,,,,,,,,,,,,0,2,Appartement,79,3,S,sols,,,115,4.25285,44.234493
2019-393186,2019-03-07,000001,Vente,122600,,,LE VILLAGE,B030,30500,30247,Saint-Denis,30,,,302470000B0270,,,,,,,,,,,,,0,,,,,S,sols,,,340,4.252885,44.234292
2019-393186,2019-03-07,000001,Vente,122600,,,LE VILLAGE,B030,30500,30247,Saint-Denis,30,,,302470000B0796,,,,,,,,,,,,,0,,,,,S,sols,,,13,4.252752,44.23448
2019-393250,2019-02-25,000001,Vente,63000,,,LE RIBAS,B023,30500,30247,Saint-Denis,30,,,302470000B0004,,,,,,,,,,,,,0,,,,,T,terres,,,2260,,
2019-393626,2019-04-01,000001,Vente,60000,5096,,ANCIENNE ROUTE,0010,30500,30247,Saint-Denis,30,,,302470000B0485,,,,,,,,,,,,,0,1,Maison,18,1,S,sols,,,340,4.238202,44.236193
2019-394412,2019-06-27,000001,Vente,6500,,,PIQUARET,B018,30500,30247,Saint-Denis,30,,,302470000B0667,,,,,,,,,,,,,0,,,,,T,terres,,,3385,4.245863,44.242694
2019-394600,2019-07-26,000001,Vente,156850,,,CROS DE MODE,B008,30500,30247,Saint-Denis,30,,,302470000A0214,,,,,,,,,,,,,0,,,,,P,prés,,,3906,4.260905,44.231461
2019-394600,2019-07-26,000001,Vente,156850,5013,,RUE DE LA CURE,0050,30500,30247,Saint-Denis,30,,,302470000B0318,,,,,,,,,,,,,0,1,Maison,63,3,S,sols,,,250,4.25116,44.232711
2019-395140,2019-09-16,000001,Vente,1,,,LE SERRET,B025,30500,30247,Saint-Denis,30,,,302470000B0132,,,,,,,,,,,,,0,,,,,T,terres,,,2090,4.251445,44.229698
2019-395140,2019-09-16,000001,Vente,1,,,PIQUARET,B018,30500,30247,Saint-Denis,30,,,302470000B0666,,,,,,,,,,,,,0,,,,,T,terres,,,2110,4.245605,44.242997
2019-395140,2019-09-16,000001,Vente,1,,,PIQUARET,B018,30500,30247,Saint-Denis,30,,,302470000B0666,,,,,,,,,,,,,0,,,,,T,terres,,,2110,4.245605,44.242997
2019-395550,2019-10-23,000001,Vente,6500,,,PIQUARET,B018,30500,30247,Saint-Denis,30,,,302470000B0667,,,,,,,,,,,,,0,,,,,T,terres,,,3385,4.245863,44.242694
