id_mutation,date_mutation,numero_disposition,nature_mutation,valeur_fonciere,adresse_numero,adresse_suffixe,adresse_nom_voie,adresse_code_voie,code_postal,code_commune,nom_commune,code_departement,ancien_code_commune,ancien_nom_commune,id_parcelle,ancien_id_parcelle,numero_volume,lot1_numero,lot1_surface_carrez,lot2_numero,lot2_surface_carrez,lot3_numero,lot3_surface_carrez,lot4_numero,lot4_surface_carrez,lot5_numero,lot5_surface_carrez,nombre_lots,code_type_local,type_local,surface_reelle_bati,nombre_pieces_principales,code_nature_culture,nature_culture,code_nature_culture_speciale,nature_culture_speciale,surface_terrain,longitude,latitude
2019-376816,2019-01-17,000001,Vente,1,,,PIED MOULEZAN,B007,30350,30314,Savignargues,30,,,303140000A0782,,,,,,,,,,,,,0,,,,,T,terres,,,72,4.087873,43.961257
2019-377232,2019-02-05,000001,Vente,320000,5080,,RUE DU 19 MARS 1962,0060,30350,30314,Savignargues,30,,,303140000A0820,,,,,,,,,,,,,0,1,Maison,170,6,S,sols,,,1000,4.086442,43.961358
2019-377232,2019-02-05,000001,Vente,320000,5080,,RUE DU 19 MARS 1962,0060,30350,30314,Savignargues,30,,,303140000A0820,,,,,,,,,,,,,0,3,Dépendance,,0,T,terres,,,2031,4.086442,43.961358
2019-377232,2019-02-05,000001,Vente,320000,5080,,RUE DU 19 MARS 1962,0060,30350,30314,Savignargues,30,,,303140000A0820,,,,,,,,,,,,,0,1,Maison,170,6,T,terres,,,2031,4.086442,43.961358
2019-377232,2019-02-05,000001,Vente,320000,5080,,RUE DU 19 MARS 1962,0060,30350,30314,Savignargues,30,,,303140000A0820,,,,,,,,,,,,,0,3,Dépendance,,0,S,sols,,,1000,4.086442,43.961358
2019-378482,2019-04-02,000002,Vente,79900,,,LE VILLAGE,B009,30350,30314,Savignargues,30,,,303140000A0706,,,,,,,,,,,,,0,,,,,S,sols,,,572,4.086396,43.964239
2019-378482,2019-04-02,000002,Vente,79900,,,LE VILLAGE,B009,30350,30314,Savignargues,30,,,303140000A0843,,,,,,,,,,,,,0,,,,,AB,terrains a bâtir,,,1064,4.086711,43.964202
2019-379087,2019-04-02,000002,Echange,1000,,,MAS MAROT,B005,30350,30314,Savignargues,30,,,303140000A0850,,,,,,,,,,,,,0,,,,,S,sols,,,4,4.083099,43.961575
2019-379087,2019-04-02,000003,Echange,1000,,,MAS MAROT,B005,30350,30314,Savignargues,30,,,303140000A0852,,,,,,,,,,,,,0,,,,,S,sols,,,11,4.08313,43.961611
2019-379090,2019-04-02,000001,Vente,185000,,,MAS MAROT,B005,30350,30314,Savignargues,30,,,303140000A0848,,,,,,,,,,,,,0,,,,,S,sols,,,614,4.083003,43.961667
2019-379090,2019-04-02,000001,Vente,185000,,,MAS MAROT,B005,30350,30314,Savignargues,30,,,303140000A0852,,,,,,,,,,,,,0,,,,,S,sols,,,11,4.08313,43.961611
2019-385564,2019-11-25,000001,Vente,58000,,,PIED MOULEZAN,B007,30350,30314,Savignargues,30,,,303140000A0823,,,,,,,,,,,,,0,,,,,VI,vignes,,,979,4.086883,43.964693
2019-385913,2019-12-16,000001,Vente,50000,,,PIED MOULEZAN,B007,30350,30314,Savignargues,30,,,303140000A0825,,,,,,,,,,,,,0,,,,,VI,vignes,,,1336,4.087236,43.964337
2019-386697,2019-11-26,000001,Adjudication,35000,5004,,RUE DES VINS,0350,30350,30314,Savignargues,30,,,303140000A0450,,,,,,,,,,,,,0,1,Maison,110,4,S,sols,,,88,4.083735,43.96262
