id_mutation,date_mutation,numero_disposition,nature_mutation,valeur_fonciere,adresse_numero,adresse_suffixe,adresse_nom_voie,adresse_code_voie,code_postal,code_commune,nom_commune,code_departement,ancien_code_commune,ancien_nom_commune,id_parcelle,ancien_id_parcelle,numero_volume,lot1_numero,lot1_surface_carrez,lot2_numero,lot2_surface_carrez,lot3_numero,lot3_surface_carrez,lot4_numero,lot4_surface_carrez,lot5_numero,lot5_surface_carrez,nombre_lots,code_type_local,type_local,surface_reelle_bati,nombre_pieces_principales,code_nature_culture,nature_culture,code_nature_culture_speciale,nature_culture_speciale,surface_terrain,longitude,latitude
2019-386972,2019-02-01,000001,Vente,9600,,,LESPINAS,B046,30700,30337,Vallabrix,30,,,303370000B0463,,,,,,,,,,,,,0,,,,,T,terres,,,700,4.474191,44.054857
2019-386972,2019-02-01,000001,Vente,9600,,,LESPINAS,B046,30700,30337,Vallabrix,30,,,303370000B0463,,,,,,,,,,,,,0,,,,,VI,vignes,,,2400,4.474191,44.054857
2019-386972,2019-02-01,000001,Vente,9600,,,LESPINAS,B046,30700,30337,Vallabrix,30,,,303370000B0464,,,,,,,,,,,,,0,,,,,T,terres,,,700,4.474881,44.054787
2019-386972,2019-02-01,000001,Vente,9600,,,LESPINAS,B046,30700,30337,Vallabrix,30,,,303370000B0464,,,,,,,,,,,,,0,,,,,VI,vignes,,,1850,4.474881,44.054787
2019-386972,2019-02-01,000001,Vente,9600,,,LESPINAS,B046,30700,30337,Vallabrix,30,,,303370000B0465,,,,,,,,,,,,,0,,,,,T,terres,,,600,4.474553,44.055282
2019-386972,2019-02-01,000001,Vente,9600,,,LESPINAS,B046,30700,30337,Vallabrix,30,,,303370000B0465,,,,,,,,,,,,,0,,,,,VI,vignes,,,2630,4.474553,44.055282
2019-388257,2019-04-11,000001,Vente,6650,,,BOUYER,B007,30700,30337,Vallabrix,30,,,303370000B1611,,,,,,,,,,,,,0,,,,,T,terres,,,133,4.47449,44.06036
2019-389357,2019-06-25,000001,Vente,10500,,,GARRIAN,B036,30700,30337,Vallabrix,30,,,303370000B0559,,,,,,,,,,,,,0,,,,,VI,vignes,,,7620,4.469344,44.059259
2019-389668,2019-07-16,000001,Vente,304350,5203,,GR GRAND RUE,0018,30700,30337,Vallabrix,30,,,303370000B1433,,,,,,,,,,,,,0,1,Maison,125,4,S,sols,,,79,4.477826,44.060861
2019-389668,2019-07-16,000001,Vente,304350,,,LE VILLAGE,B069,30700,30337,Vallabrix,30,,,303370000B1525,,,,,,,,,,,,,0,,,,,S,sols,,,32,4.477829,44.06091
2019-389668,2019-07-16,000001,Vente,304350,,,LE VILLAGE,B069,30700,30337,Vallabrix,30,,,303370000B1526,,,,,,,,,,,,,0,,,,,S,sols,,,15,4.477821,44.060952
2019-389900,2019-07-26,000001,Vente,445900,5231,,CHE DU RESERVOIR,0031,30700,30337,Vallabrix,30,,,303370000B1503,,,,,,,,,,,,,0,1,Maison,148,5,S,sols,,,705,4.482568,44.061943
2019-389900,2019-07-26,000001,Vente,445900,,,CHE DU RESERVOIR,0031,30700,30337,Vallabrix,30,,,303370000B1507,,,,,,,,,,,,,0,,,,,S,sols,,,629,4.482693,44.061775
2019-390093,2019-08-01,000001,Vente,67000,,,LA COSTE,B026,30700,30337,Vallabrix,30,,,303370000B0684,,,,,,,,,,,,,0,,,,,S,sols,,,505,4.481665,44.061963
2019-390243,2019-07-30,000001,Vente,240700,,,GRAND PLANAS,B043,30700,30337,Vallabrix,30,,,303370000B1460,,,,,,,,,,,,,0,,,,,S,sols,,,411,4.473441,44.061844
2019-390243,2019-07-30,000001,Vente,240700,5177,,CHE DE LA MADONE,0024,30700,30337,Vallabrix,30,,,303370000B1462,,,,,,,,,,,,,0,1,Maison,101,5,S,sols,,,731,4.473606,44.061799
2019-390408,2019-08-20,000001,Vente,1500,,,LA LAUZE,B045,30700,30337,Vallabrix,30,,,303370000B0968,,,,,,,,,,,,,0,,,,,T,terres,,,2635,4.483119,44.057135
2019-390412,2019-08-26,000001,Vente,390590,5125,,CHE DU GRAND PLANAS,0017,30700,30337,Vallabrix,30,,,303370000B1288,,,,,,,,,,,,,0,1,Maison,135,4,VE,vergers,OLIVE,Oliveraie ou oliviers,1020,4.473088,44.060245
2019-390412,2019-08-26,000001,Vente,390590,5125,,CHE DU GRAND PLANAS,0017,30700,30337,Vallabrix,30,,,303370000B1288,,,,,,,,,,,,,0,1,Maison,40,1,S,sols,,,500,4.473088,44.060245
2019-390412,2019-08-26,000001,Vente,390590,5125,,CHE DU GRAND PLANAS,0017,30700,30337,Vallabrix,30,,,303370000B1288,,,,,,,,,,,,,0,1,Maison,135,4,S,sols,,,500,4.473088,44.060245
2019-390412,2019-08-26,000001,Vente,390590,5125,,CHE DU GRAND PLANAS,0017,30700,30337,Vallabrix,30,,,303370000B1288,,,,,,,,,,,,,0,1,Maison,40,1,VE,vergers,OLIVE,Oliveraie ou oliviers,1020,4.473088,44.060245
2019-390412,2019-08-26,000001,Vente,390590,,,BOUYER,B007,30700,30337,Vallabrix,30,,,303370000B1357,,,,,,,,,,,,,0,,,,,VE,vergers,OLIVE,Oliveraie ou oliviers,63,4.47298,44.06049
2019-391106,2019-09-30,000001,Vente,32680,,,LE PLAN,B058,30700,30337,Vallabrix,30,,,303370000A0014,,,,,,,,,,,,,0,,,,,VI,vignes,,,2920,4.480803,44.068926
2019-391106,2019-09-30,000001,Vente,32680,,,LE PLAN,B058,30700,30337,Vallabrix,30,,,303370000A0015,,,,,,,,,,,,,0,,,,,VI,vignes,,,2370,4.48112,44.068881
2019-391106,2019-09-30,000001,Vente,32680,,,LE PLAN,B058,30700,30337,Vallabrix,30,,,303370000A0016,,,,,,,,,,,,,0,,,,,VI,vignes,,,2010,4.480317,44.068283
2019-391106,2019-09-30,000001,Vente,32680,,,LE PLAN,B058,30700,30337,Vallabrix,30,,,303370000A0017,,,,,,,,,,,,,0,,,,,VI,vignes,,,4360,4.480084,44.067949
2019-391106,2019-09-30,000001,Vente,32680,,,LE PLAN,B058,30700,30337,Vallabrix,30,,,303370000A0027,,,,,,,,,,,,,0,,,,,VI,vignes,,,1320,4.482053,44.066814
2019-391106,2019-09-30,000001,Vente,32680,,,LE PLAN,B058,30700,30337,Vallabrix,30,,,303370000A0041,,,,,,,,,,,,,0,,,,,VI,vignes,,,4060,4.481648,44.066037
2019-391106,2019-09-30,000001,Vente,32680,,,LUSSAN,B053,30700,30337,Vallabrix,30,,,303370000B0794,,,,,,,,,,,,,0,,,,,VI,vignes,,,830,4.492716,44.061308
2019-391106,2019-09-30,000001,Vente,32680,,,LUSSAN,B053,30700,30337,Vallabrix,30,,,303370000B0795,,,,,,,,,,,,,0,,,,,VI,vignes,,,807,4.492473,44.06135
2019-391106,2019-09-30,000001,Vente,32680,,,LUSSAN,B053,30700,30337,Vallabrix,30,,,303370000B0803,,,,,,,,,,,,,0,,,,,VI,vignes,,,6743,4.49271,44.061196
2019-391106,2019-09-30,000001,Vente,32680,,,LUSSAN,B053,30700,30337,Vallabrix,30,,,303370000B0804,,,,,,,,,,,,,0,,,,,L,landes,,,620,4.493148,44.061896
2019-391871,2019-11-14,000001,Echange,16000,,,COULORGUES,B030,30700,30337,Vallabrix,30,,,303370000A0691,,,,,,,,,,,,,0,,,,,VI,vignes,,,6000,4.497428,44.065757
2019-391871,2019-11-14,000001,Echange,16000,,,COULORGUES,B030,30700,30337,Vallabrix,30,,,303370000A0693,,,,,,,,,,,,,0,,,,,VI,vignes,,,3050,4.498553,44.065269
2019-391871,2019-11-14,000001,Echange,16000,,,COULORGUES,B030,30700,30337,Vallabrix,30,,,303370000A0694,,,,,,,,,,,,,0,,,,,VI,vignes,,,2740,4.498688,44.065564
2019-391871,2019-11-14,000001,Echange,16000,,,COULORGUES,B030,30700,30337,Vallabrix,30,,,303370000A0695,,,,,,,,,,,,,0,,,,,VI,vignes,,,4740,4.498943,44.065774
2019-391904,2019-11-07,000001,Vente,725175,,,GRAND CAMP,B040,30700,30337,Vallabrix,30,,,303370000B1630,,,,,,,,,,,,,0,,,,,S,sols,,,1000,4.478782,44.059856
2019-391904,2019-11-07,000001,Vente,725175,,,GRAND CAMP,B040,30700,30337,Vallabrix,30,,,303370000B1630,,,,,,,,,,,,,0,,,,,T,terres,,,1698,4.478782,44.059856
2019-392131,2019-11-29,000002,Vente,1,,,GRAND CAMP,B040,30700,30337,Vallabrix,30,,,303370000B1643,,,,,,,,,,,,,0,,,,,T,terres,,,393,4.476795,44.060068
