id_mutation,date_mutation,numero_disposition,nature_mutation,valeur_fonciere,adresse_numero,adresse_suffixe,adresse_nom_voie,adresse_code_voie,code_postal,code_commune,nom_commune,code_departement,ancien_code_commune,ancien_nom_commune,id_parcelle,ancien_id_parcelle,numero_volume,lot1_numero,lot1_surface_carrez,lot2_numero,lot2_surface_carrez,lot3_numero,lot3_surface_carrez,lot4_numero,lot4_surface_carrez,lot5_numero,lot5_surface_carrez,nombre_lots,code_type_local,type_local,surface_reelle_bati,nombre_pieces_principales,code_nature_culture,nature_culture,code_nature_culture_speciale,nature_culture_speciale,surface_terrain,longitude,latitude
2019-472056,2019-01-11,000001,Vente,130000,,,BARRY,B004,33420,33196,Guillac,33,,,331960000A0303,,,,,,,,,,,,,0,,,,,T,terres,,,736,-0.210739,44.806743
2019-472056,2019-01-11,000001,Vente,130000,1,,BARRY,B004,33420,33196,Guillac,33,,,331960000A0304,,,,,,,,,,,,,0,1,Maison,159,5,S,sols,,,628,-0.211198,44.80688
2019-472056,2019-01-11,000001,Vente,130000,,,BARRY,B004,33420,33196,Guillac,33,,,331960000A0305,,,,,,,,,,,,,0,,,,,P,prés,,,2937,-0.210957,44.806996
2019-475793,2019-09-23,000001,Vente,55000,4,,PAS DE POUNTET,B050,33420,33196,Guillac,33,,,331960000B0474,,,,,,,,,,,,,0,1,Maison,96,4,S,sols,,,225,-0.21026,44.804614
2019-475793,2019-09-23,000001,Vente,55000,,,PAS DE POUNTET,B050,33420,33196,Guillac,33,,,331960000B0477,,,,,,,,,,,,,0,,,,,S,sols,,,1185,-0.210407,44.804505
2019-476137,2019-10-16,000001,Vente,245000,48,,MAUROS OUEST,B048,33420,33196,Guillac,33,,,331960000B0068,,,,,,,,,,,,,0,1,Maison,111,3,S,sols,,,391,-0.21106,44.804886
2019-476137,2019-10-16,000001,Vente,245000,,,MAUROS OUEST,B048,33420,33196,Guillac,33,,,331960000B0069,,,,,,,,,,,,,0,,,,,J,jardins,,,1045,-0.211125,44.80467
2019-476137,2019-10-16,000001,Vente,245000,,,MAUROS OUEST,B048,33420,33196,Guillac,33,,,331960000B0070,,,,,,,,,,,,,0,,,,,J,jardins,,,595,-0.210813,44.804527
