id_mutation,date_mutation,numero_disposition,nature_mutation,valeur_fonciere,adresse_numero,adresse_suffixe,adresse_nom_voie,adresse_code_voie,code_postal,code_commune,nom_commune,code_departement,ancien_code_commune,ancien_nom_commune,id_parcelle,ancien_id_parcelle,numero_volume,lot1_numero,lot1_surface_carrez,lot2_numero,lot2_surface_carrez,lot3_numero,lot3_surface_carrez,lot4_numero,lot4_surface_carrez,lot5_numero,lot5_surface_carrez,nombre_lots,code_type_local,type_local,surface_reelle_bati,nombre_pieces_principales,code_nature_culture,nature_culture,code_nature_culture_speciale,nature_culture_speciale,surface_terrain,longitude,latitude
2019-477982,2019-03-21,000001,Vente,15000,,,LENCLOS,B017,33190,33479,Saint-Sève,33,,,334790000A0232,,,,,,,,,,,,,0,,,,,P,prés,,,10690,-0.019159,44.610765
2019-477982,2019-03-21,000001,Vente,15000,,,LENCLOS,B017,33190,33479,Saint-Sève,33,,,334790000A0234,,,,,,,,,,,,,0,,,,,T,terres,,,16190,-0.019819,44.610066
2019-477982,2019-03-21,000001,Vente,15000,,,LENCLOS,B017,33190,33479,Saint-Sève,33,,,334790000A0234,,,,,,,,,,,,,0,,,,,T,terres,,,15135,-0.019819,44.610066
2019-477982,2019-03-21,000001,Vente,15000,,,LENCLOS,B017,33190,33479,Saint-Sève,33,,,334790000A0235,,,,,,,,,,,,,0,,,,,BT,taillis simples,,,495,-0.018865,44.609127
2019-477982,2019-03-21,000001,Vente,15000,,,CARDONNETTE,B007,33190,33479,Saint-Sève,33,,,334790000B0677,,,,,,,,,,,,,0,,,,,T,terres,,,6958,-0.021466,44.607326
2019-478593,2019-10-03,000001,Vente,420000,,,LACROISILLE,B015,33190,33479,Saint-Sève,33,,,334790000B0341,,,,,,,,,,,,,0,,,,,J,jardins,,,840,-0.022211,44.595106
2019-478593,2019-10-03,000001,Vente,420000,,,LACROISILLE,B015,33190,33479,Saint-Sève,33,,,334790000B0342,,,,,,,,,,,,,0,,,,,P,prés,,,985,-0.021686,44.594961
2019-478593,2019-10-03,000001,Vente,420000,,,LACROISILLE,B015,33190,33479,Saint-Sève,33,,,334790000B0345,,,,,,,,,,,,,0,,,,,VI,vignes,,,1670,-0.022332,44.594815
2019-478593,2019-10-03,000001,Vente,420000,3,,LACROISILLE,B015,33190,33479,Saint-Sève,33,,,334790000B0674,,,,,,,,,,,,,0,1,Maison,150,4,S,sols,,,2284,-0.021907,44.595262
2019-478665,2019-10-23,000001,Vente,195500,,,AU MOULIN,B021,33190,33479,Saint-Sève,33,,,334790000B0027,,,,,,,,,,,,,0,,,,,E,eaux,ETANG,Etangs,510,-0.035353,44.611556
2019-478665,2019-10-23,000001,Vente,195500,,,STERLING,B029,33190,33479,Saint-Sève,33,,,334790000B0226,,,,,,,,,,,,,0,,,,,P,prés,,,4050,-0.034594,44.609787
2019-478665,2019-10-23,000001,Vente,195500,,,STERLING,B029,33190,33479,Saint-Sève,33,,,334790000B0227,,,,,,,,,,,,,0,,,,,P,prés,,,1325,-0.034665,44.610159
2019-478665,2019-10-23,000001,Vente,195500,3,,STERLING,B029,33190,33479,Saint-Sève,33,,,334790000B0228,,,,,,,,,,,,,0,1,Maison,100,4,S,sols,,,485,-0.035275,44.610221
2019-478665,2019-10-23,000001,Vente,195500,,,STERLING,B029,33190,33479,Saint-Sève,33,,,334790000B0229,,,,,,,,,,,,,0,,,,,P,prés,,,680,-0.035332,44.610023
2019-478665,2019-10-23,000001,Vente,195500,,,STERLING,B029,33190,33479,Saint-Sève,33,,,334790000B0230,,,,,,,,,,,,,0,,,,,P,prés,,,862,-0.03559,44.609928
2019-478665,2019-10-23,000001,Vente,195500,,,STERLING,B029,33190,33479,Saint-Sève,33,,,334790000B0230,,,,,,,,,,,,,0,,,,,S,sols,,,193,-0.03559,44.609928
2019-478665,2019-10-23,000001,Vente,195500,,,STERLING,B029,33190,33479,Saint-Sève,33,,,334790000B0231,,,,,,,,,,,,,0,,,,,S,sols,,,715,-0.035632,44.610146
2019-478665,2019-10-23,000001,Vente,195500,,,STERLING,B029,33190,33479,Saint-Sève,33,,,334790000B0232,,,,,,,,,,,,,0,,,,,S,sols,,,895,-0.035628,44.610361
2019-478665,2019-10-23,000001,Vente,195500,,,STERLING,B029,33190,33479,Saint-Sève,33,,,334790000B0233,,,,,,,,,,,,,0,,,,,P,prés,,,420,-0.035892,44.610653
2019-478665,2019-10-23,000001,Vente,195500,,,STERLING,B029,33190,33479,Saint-Sève,33,,,334790000B0443,,,,,,,,,,,,,0,,,,,P,prés,,,392,-0.034753,44.609607
2019-478934,2019-07-04,000001,Adjudication,120000,3,,LOT DES 4 VENTS,A005,33190,33479,Saint-Sève,33,,,334790000B0698,,,,,,,,,,,,,0,1,Maison,85,4,J,jardins,,,1322,-0.029236,44.610585
2019-478934,2019-07-04,000001,Adjudication,120000,3,,LOT DES 4 VENTS,A005,33190,33479,Saint-Sève,33,,,334790000B0698,,,,,,,,,,,,,0,1,Maison,85,4,S,sols,,,500,-0.029236,44.610585
