id_mutation,date_mutation,numero_disposition,nature_mutation,valeur_fonciere,adresse_numero,adresse_suffixe,adresse_nom_voie,adresse_code_voie,code_postal,code_commune,nom_commune,code_departement,ancien_code_commune,ancien_nom_commune,id_parcelle,ancien_id_parcelle,numero_volume,lot1_numero,lot1_surface_carrez,lot2_numero,lot2_surface_carrez,lot3_numero,lot3_surface_carrez,lot4_numero,lot4_surface_carrez,lot5_numero,lot5_surface_carrez,nombre_lots,code_type_local,type_local,surface_reelle_bati,nombre_pieces_principales,code_nature_culture,nature_culture,code_nature_culture_speciale,nature_culture_speciale,surface_terrain,longitude,latitude
2019-548821,2019-01-14,000001,Vente,9000,5,,LES MOLLES VILLAGE,B338,36200,36022,Bouesse,36,,,360220000E0176,,,,,,,,,,,,,0,1,Maison,43,2,S,sols,,,552,1.711675,46.607763
2019-548937,2019-01-11,000001,Vente,50000,5012,,LE BOURG,B026,36200,36022,Bouesse,36,,,36022000AM0146,,,,,,,,,,,,,0,3,Dépendance,,0,S,sols,,,28,1.687975,46.616642
2019-548937,2019-01-11,000001,Vente,50000,,,LE BOURG,B026,36200,36022,Bouesse,36,,,36022000AM0153,,,,,,,,,,,,,0,,,,,VI,vignes,,,564,1.688128,46.616888
2019-548937,2019-01-11,000001,Vente,50000,,,LE BOURG,B026,36200,36022,Bouesse,36,,,36022000AM0153,,,,,,,,,,,,,0,,,,,S,sols,,,673,1.688128,46.616888
2019-548937,2019-01-11,000001,Vente,50000,5011,,LE BOURG,B026,36200,36022,Bouesse,36,,,36022000AM0154,,,,,,,,,,,,,0,1,Maison,90,4,S,sols,,,592,1.687881,46.616771
2019-549014,2019-01-23,000001,Vente,85000,3,,IMP DES BEGATS,0009,36200,36022,Bouesse,36,,,36022000AM0260,,,,,,,,,,,,,0,1,Maison,114,5,S,sols,,,1059,1.689303,46.618742
2019-549266,2019-02-18,000001,Vente,37000,,,LES MOLLES,B227,36200,36022,Bouesse,36,,,360220000E0192,,,,,,,,,,,,,0,,,,,J,jardins,,,255,1.711681,46.607299
2019-549266,2019-02-18,000001,Vente,37000,,,LES MOLLES,B227,36200,36022,Bouesse,36,,,360220000E0537,,,,,,,,,,,,,0,,,,,T,terres,,,116,1.711708,46.607461
2019-549266,2019-02-18,000001,Vente,37000,,,LES MOLLES,B227,36200,36022,Bouesse,36,,,360220000E0538,,,,,,,,,,,,,0,,,,,S,sols,,,6,1.711873,46.607558
2019-549266,2019-02-18,000001,Vente,37000,9,,LES MOLLES VILLAGE,B338,36200,36022,Bouesse,36,,,360220000E0539,,,,,,,,,,,,,0,1,Maison,48,2,S,sols,,,578,1.711912,46.607466
2019-550430,2019-04-24,000001,Vente,94000,4,,LES TOUCHETTES,B322,36200,36022,Bouesse,36,,,360220000D0150,,,,,,,,,,,,,0,1,Maison,93,4,J,jardins,,,541,1.68662,46.626204
2019-550430,2019-04-24,000001,Vente,94000,4,,LES TOUCHETTES,B322,36200,36022,Bouesse,36,,,360220000D0150,,,,,,,,,,,,,0,1,Maison,93,4,S,sols,,,461,1.68662,46.626204
2019-550541,2019-05-10,000001,Vente,28000,,,LE BOURG,B026,36200,36022,Bouesse,36,,,36022000AM0044,,,,,,,,,,,,,0,,,,,J,jardins,,,990,1.687363,46.61645
2019-550541,2019-05-10,000001,Vente,28000,3,,RUE GRANDE,0015,36200,36022,Bouesse,36,,,36022000AM0045,,,,,,,,,,,,,0,1,Maison,103,4,S,sols,,,288,1.687384,46.616295
2019-550672,2019-05-15,000001,Vente,13650,14,,RES DES GRANDS BUISSONS,A001,36200,36022,Bouesse,36,,,36022000AM0244,,,,,,,,,,,,,0,,,,,AB,terrains a bâtir,,,910,1.689988,46.619488
2019-550680,2019-05-21,000001,Vente,14610,16,,RES DES GRANDS BUISSONS,A001,36200,36022,Bouesse,36,,,36022000AM0245,,,,,,,,,,,,,0,,,,,AB,terrains a bâtir,,,974,1.690279,46.619665
2019-550841,2019-05-23,000001,Vente,10000,7,,RES DES GRANDS BUISSONS,A001,36200,36022,Bouesse,36,,,36022000AM0239,,,,,,,,,,,,,0,,,,,AB,terrains a bâtir,,,1206,1.689991,46.618597
2019-550842,2019-05-23,000001,Vente,374,,,LES BEGATS,B012,36200,36022,Bouesse,36,,,36022000AM0256,,,,,,,,,,,,,0,,,,,T,terres,,,304,1.68984,46.617981
2019-551014,2019-05-27,000001,Vente,255000,,,LE NOUGEAIS,B232,36200,36022,Bouesse,36,,,360220000E0037,,,,,,,,,,,,,0,,,,,BS,taillis sous futaie,,,6190,1.706696,46.617558
2019-551014,2019-05-27,000001,Vente,255000,,,LE NOUGEAIS,B232,36200,36022,Bouesse,36,,,360220000E0038,,,,,,,,,,,,,0,,,,,BS,taillis sous futaie,,,4106,1.707559,46.618356
2019-551014,2019-05-27,000001,Vente,255000,,,LA COUTURE,B159,36200,36022,Bouesse,36,,,360220000E0074,,,,,,,,,,,,,0,,,,,T,terres,,,24581,1.709908,46.619393
2019-551014,2019-05-27,000001,Vente,255000,,,LA COUTURE,B159,36200,36022,Bouesse,36,,,360220000E0075,,,,,,,,,,,,,0,,,,,T,terres,,,24122,1.708644,46.618076
2019-551014,2019-05-27,000001,Vente,255000,,,LA COUTURE,B159,36200,36022,Bouesse,36,,,360220000E0076,,,,,,,,,,,,,0,,,,,T,terres,,,16987,1.707045,46.61708
2019-551014,2019-05-27,000001,Vente,255000,,,LE PRE BERNARD,B271,36200,36022,Bouesse,36,,,360220000E0077,,,,,,,,,,,,,0,,,,,P,prés,,,54212,1.707093,46.615266
2019-551014,2019-05-27,000001,Vente,255000,,,LA FORET,B177,36200,36022,Bouesse,36,,,360220000E0105,,,,,,,,,,,,,0,,,,,E,eaux,ETANG,Etangs,1390,1.710312,46.617766
2019-551014,2019-05-27,000001,Vente,255000,,,LA FORET,B177,36200,36022,Bouesse,36,,,360220000E0105,,,,,,,,,,,,,0,,,,,P,prés,,,11600,1.710312,46.617766
2019-551014,2019-05-27,000001,Vente,255000,,,LA FORET,B177,36200,36022,Bouesse,36,,,360220000E0110,,,,,,,,,,,,,0,,,,,E,eaux,ETANG,Etangs,11600,1.711394,46.619152
2019-551014,2019-05-27,000001,Vente,255000,,,LE BOIS VIEUX,B021,36200,36022,Bouesse,36,,,360220000E0268,,,,,,,,,,,,,0,,,,,T,terres,,,11913,1.718304,46.621034
2019-551014,2019-05-27,000001,Vente,255000,,,LE BOIS VIEUX,B021,36200,36022,Bouesse,36,,,360220000E0269,,,,,,,,,,,,,0,,,,,T,terres,,,6495,1.717817,46.621475
2019-551014,2019-05-27,000001,Vente,255000,,,LE BOIS VIEUX,B021,36200,36022,Bouesse,36,,,360220000E0270,,,,,,,,,,,,,0,,,,,T,terres,,,4535,1.717244,46.620016
2019-551014,2019-05-27,000001,Vente,255000,,,LES COUGNEES,B153,36200,36022,Bouesse,36,,,360220000E0302,,,,,,,,,,,,,0,,,,,T,terres,,,63880,1.715664,46.619455
2019-551014,2019-05-27,000001,Vente,255000,,,LES COUGNEES,B153,36200,36022,Bouesse,36,,,360220000E0310,,,,,,,,,,,,,0,,,,,T,terres,,,7695,1.714115,46.62019
2019-551014,2019-05-27,000001,Vente,255000,,,LES COUGNEES,B153,36200,36022,Bouesse,36,,,360220000E0311,,,,,,,,,,,,,0,,,,,T,terres,,,7695,1.713264,46.619751
2019-551243,2019-06-14,000002,Vente,16000,,,LE BOURG,B026,36200,36022,Bouesse,36,,,36022000AM0230,,,,,,,,,,,,,0,,,,,J,jardins,,,227,1.685987,46.61606
2019-551243,2019-06-14,000002,Vente,16000,5032,,LE BOURG,B026,36200,36022,Bouesse,36,,,36022000AM0231,,,,,,,,,,,,,0,3,Dépendance,,0,S,sols,,,188,1.686067,46.616118
2019-551243,2019-06-14,000002,Vente,16000,8,,RTE D'ARGENTON,0003,36200,36022,Bouesse,36,,,36022000AM0280,,,,,,,,,,,,,0,,,,,S,sols,,,55,1.686176,46.61584
2019-551378,2019-07-02,000001,Vente,3542.5,12,,RES DES GRANDS BUISSONS,A001,36200,36022,Bouesse,36,,,36022000AM0249,,,,,,,,,,,,,0,,,,,AB,terrains a bâtir,,,1090,1.690872,46.619602
2019-551593,2019-07-17,000001,Vente,94000,4,,LES DESERTS,B165,36200,36022,Bouesse,36,,,360220000E0527,,,,,,,,,,,,,0,1,Maison,139,4,S,sols,,,1000,1.694683,46.621669
2019-551593,2019-07-17,000001,Vente,94000,4,,LES DESERTS,B165,36200,36022,Bouesse,36,,,360220000E0527,,,,,,,,,,,,,0,1,Maison,139,4,AG,terrains d'agrément,PARC,Parc,304,1.694683,46.621669
2019-552864,2019-10-15,000001,Vente,20000,,,MILLIABOEUF,B225,36200,36022,Bouesse,36,,,360220000F0134,,,,,,,,,,,,,0,,,,,S,sols,,,1289,1.692859,46.601864
2019-552988,2019-10-14,000001,Vente,1250,,,LES CHAMPS MARTIN,B133,36200,36022,Bouesse,36,,,360220000F0050,,,,,,,,,,,,,0,,,,,T,terres,,,5220,1.694337,46.608703
2019-553213,2019-10-26,000001,Vente,142900,,,LA VERRERIE,B326,36200,36022,Bouesse,36,,,36022000AC0246,,,,,,,,,,,,,0,,,,,S,sols,,,1084,1.66795,46.636593
2019-553224,2019-09-11,000002,Vente,3140,,,LES BORDES,B024,36200,36022,Bouesse,36,,,360220000E0140,,,,,,,,,,,,,0,,,,,T,terres,,,3191,1.713989,46.610387
2019-553224,2019-09-11,000002,Vente,3140,,,LES BORDES,B024,36200,36022,Bouesse,36,,,360220000E0141,,,,,,,,,,,,,0,,,,,VI,vignes,,,2483,1.71353,46.609782
2019-553224,2019-09-11,000002,Vente,3140,,,LES MOLLES,B227,36200,36022,Bouesse,36,,,360220000E0177,,,,,,,,,,,,,0,,,,,P,prés,,,3520,1.711421,46.608277
2019-553224,2019-09-11,000002,Vente,3140,,,LES MOLLES,B227,36200,36022,Bouesse,36,,,360220000E0181,,,,,,,,,,,,,0,,,,,P,prés,,,3720,1.711869,46.608858
2019-553224,2019-09-11,000002,Vente,3140,,,LES MOLLES,B227,36200,36022,Bouesse,36,,,360220000E0618,,,,,,,,,,,,,0,,,,,T,terres,,,500,1.711762,46.608512
2019-553224,2019-09-11,000002,Vente,3140,,,LES MOLLES,B227,36200,36022,Bouesse,36,,,360220000E0620,,,,,,,,,,,,,0,,,,,P,prés,,,5603,1.712673,46.608567
2019-553228,2019-09-11,000001,Vente,117382,7,,LES MOLLES VILLAGE,B338,36200,36022,Bouesse,36,,,360220000E0178,,,,,,,,,,,,,0,1,Maison,160,8,S,sols,,,416,1.7118,46.607842
2019-553228,2019-09-11,000001,Vente,117382,7,,LES MOLLES VILLAGE,B338,36200,36022,Bouesse,36,,,360220000E0179,,,,,,,,,,,,,0,,,,,S,sols,,,626,1.712014,46.607871
2019-553228,2019-09-11,000001,Vente,117382,,,LES MOLLES,B227,36200,36022,Bouesse,36,,,360220000E0184,,,,,,,,,,,,,0,,,,,T,terres,,,677,1.712558,46.608057
2019-553228,2019-09-11,000001,Vente,117382,,,LES MOLLES,B227,36200,36022,Bouesse,36,,,360220000E0185,,,,,,,,,,,,,0,,,,,S,sols,,,566,1.712268,46.607944
2019-553228,2019-09-11,000001,Vente,117382,,,LES MOLLES,B227,36200,36022,Bouesse,36,,,360220000E0617,,,,,,,,,,,,,0,,,,,T,terres,,,1583,1.711808,46.608209
2019-553228,2019-09-11,000001,Vente,117382,,,LES MOLLES,B227,36200,36022,Bouesse,36,,,360220000E0619,,,,,,,,,,,,,0,,,,,P,prés,,,500,1.712293,46.60819
2019-553296,2019-10-23,000001,Vente,39000,,,LES MOLLES,B227,36200,36022,Bouesse,36,,,360220000E0192,,,,,,,,,,,,,0,,,,,J,jardins,,,255,1.711681,46.607299
2019-553296,2019-10-23,000001,Vente,39000,,,LES MOLLES,B227,36200,36022,Bouesse,36,,,360220000E0537,,,,,,,,,,,,,0,,,,,T,terres,,,116,1.711708,46.607461
2019-553296,2019-10-23,000001,Vente,39000,,,LES MOLLES,B227,36200,36022,Bouesse,36,,,360220000E0538,,,,,,,,,,,,,0,,,,,S,sols,,,6,1.711873,46.607558
2019-553296,2019-10-23,000001,Vente,39000,9,,LES MOLLES VILLAGE,B338,36200,36022,Bouesse,36,,,360220000E0539,,,,,,,,,,,,,0,1,Maison,48,2,S,sols,,,578,1.711912,46.607466
2019-553487,2019-10-29,000001,Vente,73675,,,PACAGE DE L ETANG,B237,36200,36022,Bouesse,36,,,36022000AO0022,,,,,,,,,,,,,0,,,,,J,jardins,,,709,1.680944,46.614295
2019-553487,2019-10-29,000001,Vente,73675,7,,RTE D'ARGENTON,0003,36200,36022,Bouesse,36,,,36022000AO0023,,,,,,,,,,,,,0,1,Maison,81,3,S,sols,,,1427,1.680793,46.614431
2019-553487,2019-10-29,000001,Vente,73675,,,PACAGE DE L ETANG,B237,36200,36022,Bouesse,36,,,36022000AO0024,,,,,,,,,,,,,0,,,,,T,terres,,,1306,1.681444,46.614445
2019-553506,2019-11-16,000001,Vente,2200,,,LES MOLLES,B227,36200,36022,Bouesse,36,,,360220000F0281,,,,,,,,,,,,,0,,,,,J,jardins,,,2150,1.710839,46.605334
2019-553506,2019-11-16,000001,Vente,2200,,,LES MOLLES,B227,36200,36022,Bouesse,36,,,360220000F0281,,,,,,,,,,,,,0,,,,,T,terres,,,1416,1.710839,46.605334
2019-553758,2019-11-21,000001,Vente,,,,LES COUGNEES,B153,36200,36022,Bouesse,36,,,360220000E0307,,,,,,,,,,,,,0,,,,,E,eaux,MARE,Mare,1533,1.714281,46.62216
2019-553758,2019-11-21,000001,Vente,,,,LES COUGNEES,B153,36200,36022,Bouesse,36,,,360220000E0307,,,,,,,,,,,,,0,,,,,T,terres,,,12475,1.714281,46.62216
2019-553758,2019-11-21,000001,Vente,,,,LES COUGNEES,B153,36200,36022,Bouesse,36,,,360220000E0308,,,,,,,,,,,,,0,,,,,T,terres,,,11615,1.714192,46.621
2019-553758,2019-11-21,000002,Vente,,,,LA POPILIERE,B267,36200,36022,Bouesse,36,,,36022000AN0048,,,,,,,,,,,,,0,,,,,T,terres,,,1679,1.708808,46.622789
2019-553758,2019-11-21,000002,Vente,,,,LES COUGNEES,B153,36200,36022,Bouesse,36,,,360220000E0306,,,,,,,,,,,,,0,,,,,T,terres,,,20091,1.715055,46.623387
2019-553758,2019-11-21,000003,Vente,,,,LES COUGNEES,B153,36200,36022,Bouesse,36,,,360220000E0315,,,,,,,,,,,,,0,,,,,E,eaux,MARE,Mare,1833,1.713515,46.621962
2019-553758,2019-11-21,000003,Vente,,,,LES COUGNEES,B153,36200,36022,Bouesse,36,,,360220000E0315,,,,,,,,,,,,,0,,,,,T,terres,,,1631,1.713515,46.621962
2019-554513,2019-07-16,000001,Adjudication,37000,,,LES PATRATS,B245,36200,36022,Bouesse,36,,,360220000E0064,,,,,,,,,,,,,0,,,,,T,terres,,,4109,1.704844,46.620077
2019-554513,2019-07-16,000001,Adjudication,37000,,,LES PATRATS,B245,36200,36022,Bouesse,36,,,360220000E0065,,,,,,,,,,,,,0,,,,,S,sols,,,1278,1.705401,46.620573
2019-554513,2019-07-16,000001,Adjudication,37000,,,LES PATRATS,B245,36200,36022,Bouesse,36,,,360220000E0066,,,,,,,,,,,,,0,,,,,T,terres,,,1955,1.70592,46.620818
2019-554513,2019-07-16,000001,Adjudication,37000,,,LA PETITE LOGE,B254,36200,36022,Bouesse,36,,,360220000E0320,,,,,,,,,,,,,0,,,,,T,terres,,,3021,1.707601,46.621725
2019-554513,2019-07-16,000001,Adjudication,37000,,,LA PETITE LOGE,B254,36200,36022,Bouesse,36,,,360220000E0321,,,,,,,,,,,,,0,,,,,T,terres,,,1121,1.70774,46.621379
2019-554513,2019-07-16,000001,Adjudication,37000,,,LA PETITE LOGE,B254,36200,36022,Bouesse,36,,,360220000E0322,,,,,,,,,,,,,0,,,,,T,terres,,,1600,1.708044,46.621522
2019-554513,2019-07-16,000001,Adjudication,37000,,,LES PATRATS,B245,36200,36022,Bouesse,36,,,360220000E0426,,,,,,,,,,,,,0,,,,,P,prés,,,4348,1.704177,46.621212
2019-554513,2019-07-16,000001,Adjudication,37000,5,,LES PATRATS,B245,36200,36022,Bouesse,36,,,360220000E0502,,,,,,,,,,,,,0,1,Maison,80,3,S,sols,,,792,1.704972,46.620831
2019-554513,2019-07-16,000001,Adjudication,37000,,,LES PATRATS,B245,36200,36022,Bouesse,36,,,360220000E0604,,,,,,,,,,,,,0,,,,,J,jardins,,,31,1.704997,46.62098
2019-554513,2019-07-16,000001,Adjudication,37000,,,PACAGE DE LA CROIX,B238,36200,36022,Bouesse,36,,,360220000F0062,,,,,,,,,,,,,0,,,,,T,terres,,,7709,1.691339,46.608531
2019-554513,2019-07-16,000001,Adjudication,37000,,,PACAGE DE LA CROIX,B238,36200,36022,Bouesse,36,,,360220000F0063,,,,,,,,,,,,,0,,,,,P,prés,,,8333,1.690351,46.607976
