id_mutation,date_mutation,numero_disposition,nature_mutation,valeur_fonciere,adresse_numero,adresse_suffixe,adresse_nom_voie,adresse_code_voie,code_postal,code_commune,nom_commune,code_departement,ancien_code_commune,ancien_nom_commune,id_parcelle,ancien_id_parcelle,numero_volume,lot1_numero,lot1_surface_carrez,lot2_numero,lot2_surface_carrez,lot3_numero,lot3_surface_carrez,lot4_numero,lot4_surface_carrez,lot5_numero,lot5_surface_carrez,nombre_lots,code_type_local,type_local,surface_reelle_bati,nombre_pieces_principales,code_nature_culture,nature_culture,code_nature_culture_speciale,nature_culture_speciale,surface_terrain,longitude,latitude
2019-550550,2019-04-27,000001,Vente,25000,,,LE GRAND CHAMP,B282,36400,36186,Saint-Christophe-en-Boucherie,36,,,361860000B0126,,,,,,,,,,,,,0,,,,,T,terres,,,15770,2.128402,46.692075
2019-550550,2019-04-27,000001,Vente,25000,,,LE GRAND CHAMP,B282,36400,36186,Saint-Christophe-en-Boucherie,36,,,361860000B0127,,,,,,,,,,,,,0,,,,,T,terres,,,13810,2.128223,46.692971
2019-550550,2019-04-27,000001,Vente,25000,,,LE GRAND CHAMP,B282,36400,36186,Saint-Christophe-en-Boucherie,36,,,361860000B0128,,,,,,,,,,,,,0,,,,,T,terres,,,12110,2.129057,46.694014
2019-550550,2019-04-27,000001,Vente,25000,,,LES SINETS,B460,36400,36186,Saint-Christophe-en-Boucherie,36,,,361860000B0130,,,,,,,,,,,,,0,,,,,T,terres,,,5900,2.128963,46.695277
2019-550550,2019-04-27,000001,Vente,25000,,,LES SINETS,B460,36400,36186,Saint-Christophe-en-Boucherie,36,,,361860000B0137,,,,,,,,,,,,,0,,,,,S,sols,,,780,2.129625,46.694717
2019-550550,2019-04-27,000001,Vente,25000,,,LES SINETS,B460,36400,36186,Saint-Christophe-en-Boucherie,36,,,361860000B0138,,,,,,,,,,,,,0,,,,,E,eaux,ETANG,Etangs,650,2.129195,46.694566
2019-550550,2019-04-27,000001,Vente,25000,,,LES SINETS,B460,36400,36186,Saint-Christophe-en-Boucherie,36,,,361860000B0138,,,,,,,,,,,,,0,,,,,T,terres,,,3010,2.129195,46.694566
2019-550550,2019-04-27,000001,Vente,25000,,,LES SINETS,B460,36400,36186,Saint-Christophe-en-Boucherie,36,,,361860000B0139,,,,,,,,,,,,,0,,,,,T,terres,,,1030,2.129657,46.69439
2019-550550,2019-04-27,000001,Vente,25000,,,LES SINETS,B460,36400,36186,Saint-Christophe-en-Boucherie,36,,,361860000B0139,,,,,,,,,,,,,0,,,,,E,eaux,ETANG,Etangs,250,2.129657,46.69439
2019-550550,2019-04-27,000001,Vente,25000,,,LES SINETS,B460,36400,36186,Saint-Christophe-en-Boucherie,36,,,361860000B0140,,,,,,,,,,,,,0,,,,,T,terres,,,240,2.129893,46.694482
2019-550550,2019-04-27,000001,Vente,25000,,,LE GRAND PRE DES SINETS,B291,36400,36186,Saint-Christophe-en-Boucherie,36,,,361860000B0144,,,,,,,,,,,,,0,,,,,P,prés,,,13340,2.130425,46.693891
2019-550550,2019-04-27,000001,Vente,25000,,,LE GRAND PRE DES SINETS,B291,36400,36186,Saint-Christophe-en-Boucherie,36,,,361860000B0145,,,,,,,,,,,,,0,,,,,P,prés,,,12620,2.12991,46.692701
2019-550550,2019-04-27,000001,Vente,25000,,,LE GRAND PRE DES SINETS,B291,36400,36186,Saint-Christophe-en-Boucherie,36,,,361860000B0146,,,,,,,,,,,,,0,,,,,T,terres,,,20340,2.130823,46.692064
2019-550562,2019-04-27,000001,Vente,2050,,,LES PRES BRUNET,B420,36400,36186,Saint-Christophe-en-Boucherie,36,,,361860000B0087,,,,,,,,,,,,,0,,,,,P,prés,,,10250,2.133591,46.698871
2019-550564,2019-04-27,000001,Vente,500,,,LES TAILLES JEUNES,B490,36400,36186,Saint-Christophe-en-Boucherie,36,,,361860000A0227,,,,,,,,,,,,,0,,,,,L,landes,,,4935,2.118676,46.699227
2019-550966,2019-06-11,000001,Vente,2017.4,,,LA TAILLE DE BOUCHENOIRE,B470,36400,36186,Saint-Christophe-en-Boucherie,36,,,361860000E0552,,,,,,,,,,,,,0,,,,,BT,taillis simples,,,5031,2.10704,46.656459
2019-550966,2019-06-11,000001,Vente,2017.4,,,LA TAILLE DE BOUCHENOIRE,B470,36400,36186,Saint-Christophe-en-Boucherie,36,,,361860000E0553,,,,,,,,,,,,,0,,,,,BT,taillis simples,,,5056,2.107671,46.656424
2019-552216,2019-06-21,000001,Vente,125000,,,LA GROSSE MAISON,B307,36400,36186,Saint-Christophe-en-Boucherie,36,,,361860000E0394,,,,,,,,,,,,,0,,,,,J,jardins,,,700,2.125585,46.651719
2019-552216,2019-06-21,000001,Vente,125000,,,LA GROSSE MAISON,B307,36400,36186,Saint-Christophe-en-Boucherie,36,,,361860000E0395,,,,,,,,,,,,,0,,,,,T,terres,,,930,2.12515,46.651515
2019-552216,2019-06-21,000001,Vente,125000,5111,,LA GROSSE MAISON,B307,36400,36186,Saint-Christophe-en-Boucherie,36,,,361860000E0396,,,,,,,,,,,,,0,1,Maison,30,1,S,sols,,,1190,2.125553,46.651549
2019-552216,2019-06-21,000001,Vente,125000,5111,,LA GROSSE MAISON,B307,36400,36186,Saint-Christophe-en-Boucherie,36,,,361860000E0396,,,,,,,,,,,,,0,1,Maison,68,3,S,sols,,,1190,2.125553,46.651549
2019-552216,2019-06-21,000001,Vente,125000,,,LA GROSSE MAISON,B307,36400,36186,Saint-Christophe-en-Boucherie,36,,,361860000E0397,,,,,,,,,,,,,0,,,,,S,sols,,,325,2.125124,46.651331
2019-553215,2019-10-24,000001,Vente,87000,5115,,LA BRANDE DES LOGES,B037,36400,36186,Saint-Christophe-en-Boucherie,36,,,36186000ZA0002,,,,,,,,,,,,,0,1,Maison,99,1,S,sols,,,1420,2.110917,46.645369
2019-553215,2019-10-24,000001,Vente,87000,,,LA BRANDE DES LOGES,B037,36400,36186,Saint-Christophe-en-Boucherie,36,,,36186000ZA0003,,,,,,,,,,,,,0,,,,,T,terres,,,2300,2.11073,46.645622
2019-554024,2019-11-30,000001,Echange,6000,,,LE PATUREAU DES AURES,B333,36400,36186,Saint-Christophe-en-Boucherie,36,,,361860000B0072,,,,,,,,,,,,,0,,,,,BS,taillis sous futaie,,,4040,2.13163,46.699602
2019-554024,2019-11-30,000001,Echange,6000,,,LE PRE DES TROIS CHAMPS,B403,36400,36186,Saint-Christophe-en-Boucherie,36,,,361860000B0162,,,,,,,,,,,,,0,,,,,P,prés,,,6460,2.132523,46.696495
2019-554024,2019-11-30,000002,Echange,6000,,,LE CHAMP DE LA BRANDE,B081,36400,36186,Saint-Christophe-en-Boucherie,36,,,361860000H0234,,,,,,,,,,,,,0,,,,,T,terres,,,10590,2.113831,46.677072
2019-554084,2019-11-26,000001,Vente,2650,,,TERRES DES NOYERS,B494,36400,36186,Saint-Christophe-en-Boucherie,36,,,361860000C0098,,,,,,,,,,,,,0,,,,,T,terres,,,5300,2.155178,46.691636
