id_mutation,date_mutation,numero_disposition,nature_mutation,valeur_fonciere,adresse_numero,adresse_suffixe,adresse_nom_voie,adresse_code_voie,code_postal,code_commune,nom_commune,code_departement,ancien_code_commune,ancien_nom_commune,id_parcelle,ancien_id_parcelle,numero_volume,lot1_numero,lot1_surface_carrez,lot2_numero,lot2_surface_carrez,lot3_numero,lot3_surface_carrez,lot4_numero,lot4_surface_carrez,lot5_numero,lot5_surface_carrez,nombre_lots,code_type_local,type_local,surface_reelle_bati,nombre_pieces_principales,code_nature_culture,nature_culture,code_nature_culture_speciale,nature_culture_speciale,surface_terrain,longitude,latitude
2019-763451,2019-02-04,000001,Vente,35196,,,LE CORBILLON,B031,51300,51340,Maisons-en-Champagne,51,,,51340000YP0261,,,,,,,,,,,,,0,,,,,AB,terrains a bâtir,,,1257,4.49042,48.747764
2019-763785,2019-05-04,000001,Vente,20000,,,LE VILLAGE,B133,51300,51340,Maisons-en-Champagne,51,,,51340000AB0657,,,,,,,,,,,,,0,,,,,AB,terrains a bâtir,,,922,4.496482,48.75157
2019-764010,2019-07-03,000001,Vente,30000,,,LA VOIE DE CHALONS,B134,51300,51340,Maisons-en-Champagne,51,,,51340000YR0119,,,,,,,,,,,,,0,,,,,T,terres,,,903,4.489869,48.750554
2019-764107,2019-06-28,000001,Vente,148000,27,,RLE DES AUGES DE FLANCOURT,0006,51300,51340,Maisons-en-Champagne,51,,,51340000YR0091,,,,,,,,,,,,,0,1,Maison,111,7,S,sols,,,1052,4.497597,48.752348
2019-764129,2019-07-31,000001,Vente,125000,9,,RLE DES AUGES DE FLANCOURT,0006,51300,51340,Maisons-en-Champagne,51,,,51340000YR0056,,,,,,,,,,,,,0,1,Maison,100,4,S,sols,,,670,4.493417,48.751109
2019-764483,2019-11-06,000001,Vente,157850,,,LES AUGES DE FLANCOURT,B003,51300,51340,Maisons-en-Champagne,51,,,51340000YR0078,,,,,,,,,,,,,0,,,,,S,sols,,,19,4.494044,48.75113
2019-764483,2019-11-06,000001,Vente,157850,11,B,RLE DES AUGES DE FLANCOURT,0006,51300,51340,Maisons-en-Champagne,51,,,51340000YR0109,,,,,,,,,,,,,0,1,Maison,134,5,S,sols,,,643,4.493842,48.751328
2019-764483,2019-11-06,000001,Vente,157850,,,LES AUGES DE FLANCOURT,B003,51300,51340,Maisons-en-Champagne,51,,,51340000YR0111,,,,,,,,,,,,,0,,,,,S,sols,,,425,4.493688,48.751324
2019-764545,2019-11-27,000002,Vente,17000,20,,RUE DE COOLE,0012,51300,51340,Maisons-en-Champagne,51,,,51340000YP0301,,,,,,,,,,,,,0,,,,,S,sols,,,509,4.491402,48.750182
2019-764598,2019-12-04,000001,Vente,30000,,,LE CORBILLON,B031,51300,51340,Maisons-en-Champagne,51,,,51340000YP0259,,,,,,,,,,,,,0,,,,,P,prés,,,1260,4.489853,48.748784
2019-764664,2019-12-21,000001,Vente,82000,35,,RUE DE FLANCOURT,0028,51300,51340,Maisons-en-Champagne,51,,,51340000AB0040,,,,,,,,,,,,,0,1,Maison,51,3,S,sols,,,888,4.497724,48.751413
2019-764664,2019-12-21,000001,Vente,82000,,,LE VILLAGE,B133,51300,51340,Maisons-en-Champagne,51,,,51340000AB0256,,,,,,,,,,,,,0,,,,,S,sols,,,187,4.497548,48.751367
