id_mutation,date_mutation,numero_disposition,nature_mutation,valeur_fonciere,adresse_numero,adresse_suffixe,adresse_nom_voie,adresse_code_voie,code_postal,code_commune,nom_commune,code_departement,ancien_code_commune,ancien_nom_commune,id_parcelle,ancien_id_parcelle,numero_volume,lot1_numero,lot1_surface_carrez,lot2_numero,lot2_surface_carrez,lot3_numero,lot3_surface_carrez,lot4_numero,lot4_surface_carrez,lot5_numero,lot5_surface_carrez,nombre_lots,code_type_local,type_local,surface_reelle_bati,nombre_pieces_principales,code_nature_culture,nature_culture,code_nature_culture_speciale,nature_culture_speciale,surface_terrain,longitude,latitude
2019-807270,2019-01-08,000001,Vente,92330,5296,A,LE QUILLIAN DE HAUT,C347,56140,56159,Pleucadeuc,56,,,56159000ZD0167,,,,,,,,,,,,,0,1,Maison,85,4,S,sols,,,1927,-2.395158,47.780802
2019-807730,2019-02-05,000001,Vente,26000,20,,RUE LOUIS MARSILLE,0110,56140,56159,Pleucadeuc,56,,,56159000AI0483,,,,,,,,,,,,,0,,,,,S,sols,,,40,-2.371251,47.757047
2019-807730,2019-02-05,000001,Vente,26000,20,,RUE LOUIS MARSILLE,0110,56140,56159,Pleucadeuc,56,,,56159000AI0483,,,,,,,,,,,,,0,,,,,J,jardins,,,758,-2.371251,47.757047
2019-807995,2019-02-15,000002,Vente,18000,2,,RUE PASTEUR,0143,56140,56159,Pleucadeuc,56,,,56159000AI0787,,,,,,,,,,,,,0,,,,,S,sols,,,228,-2.376115,47.758231
2019-807995,2019-02-15,000002,Vente,18000,2,,RUE PASTEUR,0143,56140,56159,Pleucadeuc,56,,,56159000AI0788,,,,,,,,,,,,,0,,,,,S,sols,,,111,-2.376007,47.758247
2019-807995,2019-02-15,000002,Vente,18000,2,,RUE PASTEUR,0143,56140,56159,Pleucadeuc,56,,,56159000AI0790,,,,,,,,,,,,,0,,,,,S,sols,,,21,-2.376014,47.758079
2019-807995,2019-02-15,000002,Vente,18000,2,,RUE PASTEUR,0143,56140,56159,Pleucadeuc,56,,,56159000AI0791,,,,,,,,,,,,,0,,,,,S,sols,,,128,-2.375962,47.758249
2019-807995,2019-02-15,000002,Vente,18000,2,,RUE PASTEUR,0143,56140,56159,Pleucadeuc,56,,,56159000AI0792,,,,,,,,,,,,,0,,,,,S,sols,,,20,-2.37592,47.758167
2019-807995,2019-02-15,000002,Vente,18000,2,,RUE PASTEUR,0143,56140,56159,Pleucadeuc,56,,,56159000AI0793,,,,,,,,,,,,,0,,,,,S,sols,,,279,-2.375799,47.75826
2019-807995,2019-02-15,000002,Vente,18000,2,,RUE PASTEUR,0143,56140,56159,Pleucadeuc,56,,,56159000AI0795,,,,,,,,,,,,,0,,,,,S,sols,,,18,-2.375819,47.758128
2019-807995,2019-02-15,000002,Vente,18000,2,,RUE PASTEUR,0143,56140,56159,Pleucadeuc,56,,,56159000AI0796,,,,,,,,,,,,,0,,,,,S,sols,,,254,-2.375804,47.758113
2019-808222,2019-02-19,000001,Vente,15148,,,LA PIERRE AUX BASSINS,C111,56140,56159,Pleucadeuc,56,,,56159000ZP0349,,,,,,,,,,,,,0,,,,,AB,terrains a bâtir,,,541,-2.372485,47.7541
2019-808410,2019-02-28,000001,Vente,157000,,,TERRES DE BRANTONNAIS,B078,56140,56159,Pleucadeuc,56,,,56159000ZA0040,,,,,,,,,,,,,0,,,,,T,terres,,,790,-2.40256,47.778095
2019-808410,2019-02-28,000001,Vente,157000,,,TERRES DE BRANTONNAIS,B078,56140,56159,Pleucadeuc,56,,,56159000ZA0133,,,,,,,,,,,,,0,,,,,T,terres,,,728,-2.402434,47.77795
2019-808410,2019-02-28,000001,Vente,157000,5795,,LA CROIX BARON,B490,56140,56159,Pleucadeuc,56,,,56159000ZA0140,,,,,,,,,,,,,0,1,Maison,176,7,S,sols,,,86,-2.402618,47.777806
2019-808742,2019-03-15,000002,Vente,4000,1,,AV ST PIERRE,0160,56140,56159,Pleucadeuc,56,,,56159000AI0765,,,,,,,,,,,,,0,,,,,S,sols,,,29,-2.375174,47.758446
2019-808882,2019-03-25,000001,Vente,24900,,,LA GARE,B570,56140,56159,Pleucadeuc,56,,,56159000ZR0118,,,,,,,,,,,,,0,,,,,AB,terrains a bâtir,,,1202,-2.397242,47.761353
2019-809130,2019-03-26,000001,Vente,17000,,,AV DU GAL DE GAULLE,0067,56140,56159,Pleucadeuc,56,,,56159000AI0807,,,,,,,,,,,,,0,,,,,T,terres,,,19,-2.378505,47.758987
2019-809153,2019-03-27,000001,Vente,130450,,,TERRES DE FOULIVET,B057,56140,56159,Pleucadeuc,56,,,56159000ZW0081,,,,,,,,,,,,,0,,,,,J,jardins,,,880,-2.420689,47.77084
2019-809153,2019-03-27,000001,Vente,130450,5679,,LE FOULIVET,B548,56140,56159,Pleucadeuc,56,,,56159000ZW0083,,,,,,,,,,,,,0,1,Maison,98,4,S,sols,,,680,-2.420491,47.770862
2019-809600,2019-04-03,000002,Vente,1500,,,KERCOUET,B709,56140,56159,Pleucadeuc,56,,,56159000AH0224,,,,,,,,,,,,,0,,,,,S,sols,,,7043,-2.38536,47.748791
2019-809600,2019-04-03,000002,Vente,1500,,,KERCOUET,B709,56140,56159,Pleucadeuc,56,,,56159000AH0226,,,,,,,,,,,,,0,,,,,S,sols,,,1833,-2.384924,47.74864
2019-809600,2019-04-03,000002,Vente,1500,,,KERCOUET,B709,56140,56159,Pleucadeuc,56,,,56159000AH0238,,,,,,,,,,,,,0,,,,,P,prés,,,355,-2.384531,47.74871
2019-809600,2019-04-03,000002,Vente,1500,,,KERCOUET,B709,56140,56159,Pleucadeuc,56,,,56159000AH0239,,,,,,,,,,,,,0,,,,,S,sols,,,2646,-2.384731,47.749223
2019-809600,2019-04-03,000002,Vente,1500,,,KERCOUET,B709,56140,56159,Pleucadeuc,56,,,56159000AH0242,,,,,,,,,,,,,0,,,,,T,terres,,,24,-2.385238,47.748169
2019-809600,2019-04-03,000002,Vente,1500,,,KERCOUET,B709,56140,56159,Pleucadeuc,56,,,56159000AH0244,,,,,,,,,,,,,0,,,,,S,sols,,,2596,-2.385368,47.748364
2019-809908,2019-04-16,000001,Vente,19404,,,LA PIERRE AUX BASSINS,C111,56140,56159,Pleucadeuc,56,,,56159000ZP0418,,,,,,,,,,,,,0,,,,,T,terres,,,693,-2.372699,47.752603
2019-810134,2019-05-17,000001,Vente,9000,,,LA GRASSAIS DE HAUT,C462,56140,56159,Pleucadeuc,56,,,56159000ZS0077,,,,,,,,,,,,,0,,,,,T,terres,,,500,-2.381125,47.767967
2019-810776,2019-05-20,000001,Vente,137000,5843,,PRIZIAC,C522,56140,56159,Pleucadeuc,56,,,56159000ZM0228,,,,,,,,,,,,,0,1,Maison,93,5,S,sols,,,1000,-2.365149,47.770937
2019-810782,2019-05-23,000001,Vente,82000,5408,,LA VILLE ECHATELAIS,C446,56140,56159,Pleucadeuc,56,,,56159000ZM0224,,,,,,,,,,,,,0,1,Maison,73,3,T,terres,,,1009,-2.367627,47.77161
2019-810782,2019-05-23,000001,Vente,82000,5408,,LA VILLE ECHATELAIS,C446,56140,56159,Pleucadeuc,56,,,56159000ZM0224,,,,,,,,,,,,,0,1,Maison,48,2,S,sols,,,1385,-2.367627,47.77161
2019-810782,2019-05-23,000001,Vente,82000,5408,,LA VILLE ECHATELAIS,C446,56140,56159,Pleucadeuc,56,,,56159000ZM0224,,,,,,,,,,,,,0,1,Maison,73,3,S,sols,,,1385,-2.367627,47.77161
2019-810782,2019-05-23,000001,Vente,82000,5408,,LA VILLE ECHATELAIS,C446,56140,56159,Pleucadeuc,56,,,56159000ZM0224,,,,,,,,,,,,,0,1,Maison,48,2,T,terres,,,336,-2.367627,47.77161
2019-810782,2019-05-23,000001,Vente,82000,5408,,LA VILLE ECHATELAIS,C446,56140,56159,Pleucadeuc,56,,,56159000ZM0224,,,,,,,,,,,,,0,1,Maison,73,3,T,terres,,,336,-2.367627,47.77161
2019-810782,2019-05-23,000001,Vente,82000,5408,,LA VILLE ECHATELAIS,C446,56140,56159,Pleucadeuc,56,,,56159000ZM0224,,,,,,,,,,,,,0,1,Maison,48,2,T,terres,,,1009,-2.367627,47.77161
2019-811279,2019-06-04,000001,Vente,18000,,,AV DU GAL DE GAULLE,0067,56140,56159,Pleucadeuc,56,,,56159000AI0798,,,,,,,,,,,,,0,,,,,AB,terrains a bâtir,,,235,-2.378274,47.759204
2019-811279,2019-06-04,000001,Vente,18000,,,AV DU GAL DE GAULLE,0067,56140,56159,Pleucadeuc,56,,,56159000AI0802,,,,,,,,,,,,,0,,,,,AB,terrains a bâtir,,,224,-2.378438,47.759169
2019-811279,2019-06-04,000001,Vente,18000,,,AV DU GAL DE GAULLE,0067,56140,56159,Pleucadeuc,56,,,56159000AI0806,,,,,,,,,,,,,0,,,,,AB,terrains a bâtir,,,41,-2.378488,47.759159
2019-811283,2019-06-25,000001,Vente,5892.5,,,TERRES DU PETIT KERGO,C509,56140,56159,Pleucadeuc,56,,,56159000ZV0064,,,,,,,,,,,,,0,,,,,P,prés,,,3150,-2.416974,47.7637
2019-811283,2019-06-25,000001,Vente,5892.5,,,TERRES DU PETIT KERGO,C509,56140,56159,Pleucadeuc,56,,,56159000ZV0064,,,,,,,,,,,,,0,,,,,T,terres,,,14900,-2.416974,47.7637
2019-811283,2019-06-25,000001,Vente,5892.5,,,TERRES DU PETIT KERGO,C509,56140,56159,Pleucadeuc,56,,,56159000ZV0064,,,,,,,,,,,,,0,,,,,BR,futaies résineuses,,,9511,-2.416974,47.7637
2019-811283,2019-06-25,000001,Vente,5892.5,,,TERRES DU PETIT KERGO,C509,56140,56159,Pleucadeuc,56,,,56159000ZV0064,,,,,,,,,,,,,0,,,,,L,landes,,,739,-2.416974,47.7637
2019-811286,2019-06-25,000001,Vente,7214.35,,,TERRES DU PETIT KERGO,C509,56140,56159,Pleucadeuc,56,,,56159000ZV0065,,,,,,,,,,,,,0,,,,,T,terres,,,11400,-2.417088,47.765843
2019-811286,2019-06-25,000001,Vente,7214.35,,,TERRES DU PETIT KERGO,C509,56140,56159,Pleucadeuc,56,,,56159000ZV0146,,,,,,,,,,,,,0,,,,,L,landes,,,1670,-2.415296,47.766118
2019-811286,2019-06-25,000001,Vente,7214.35,,,TERRES DU PETIT KERGO,C509,56140,56159,Pleucadeuc,56,,,56159000ZV0146,,,,,,,,,,,,,0,,,,,P,prés,,,2646,-2.415296,47.766118
2019-811286,2019-06-25,000001,Vente,7214.35,,,TERRES DU PETIT KERGO,C509,56140,56159,Pleucadeuc,56,,,56159000ZV0146,,,,,,,,,,,,,0,,,,,P,prés,,,5293,-2.415296,47.766118
2019-811286,2019-06-25,000001,Vente,7214.35,,,TERRES DU PETIT KERGO,C509,56140,56159,Pleucadeuc,56,,,56159000ZV0146,,,,,,,,,,,,,0,,,,,T,terres,,,9969,-2.415296,47.766118
2019-811576,2019-06-21,000001,Vente,36000,,,LA GRASSAIS DE HAUT,C462,56140,56159,Pleucadeuc,56,,,56159000ZS0312,,,,,,,,,,,,,0,,,,,T,terres,,,1201,-2.381371,47.767363
2019-812012,2019-07-10,000001,Vente,75000,5401,,LA GRAS TUBOUT,C515,56140,56159,Pleucadeuc,56,,,56159000ZM0226,,,,,,,,,,,,,0,1,Maison,120,4,S,sols,,,894,-2.376645,47.768097
2019-812013,2019-07-23,000001,Vente,150000,5700,,AV DU GAL DE GAULLE,0067,56140,56159,Pleucadeuc,56,,,56159000AI0162,,,,,,,,,,,,,0,1,Maison,113,5,S,sols,,,986,,
2019-812013,2019-07-23,000001,Vente,150000,4,,RUE DUGUESCLIN,0040,56140,56159,Pleucadeuc,56,,,56159000AI0599,,,,,,,,,,,,,0,,,,,S,sols,,,229,-2.376449,47.758819
2019-812818,2019-08-08,000001,Vente,17920,,,LA PIERRE AUX BASSINS,C111,56140,56159,Pleucadeuc,56,,,56159000ZP0409,,,,,,,,,,,,,0,,,,,AB,terrains a bâtir,,,157,-2.372478,47.75294
2019-812818,2019-08-08,000001,Vente,17920,,,LA PIERRE AUX BASSINS,C111,56140,56159,Pleucadeuc,56,,,56159000ZP0443,,,,,,,,,,,,,0,,,,,AB,terrains a bâtir,,,483,-2.372436,47.753125
2019-812924,2019-08-13,000001,Vente,217000,17,,RUE DES AJONCS,0002,56140,56159,Pleucadeuc,56,,,56159000ZP0225,,,,,,,,,,,,,0,1,Maison,144,5,S,sols,,,801,-2.375198,47.756004
2019-813083,2019-09-04,000002,Vente,6000,4,,RUE DUGUESCLIN,0040,56140,56159,Pleucadeuc,56,,,56159000AI0599,,,,,,,,,,,,,0,,,,,S,sols,,,229,-2.376449,47.758819
2019-813083,2019-09-04,000002,Vente,6000,1,,AV DU GAL DE GAULLE,0067,56140,56159,Pleucadeuc,56,,,56159000AI0811,,,,,,,,,,,,,0,,,,,S,sols,,,51,-2.376606,47.758803
2019-813179,2019-09-11,000001,Vente,90000,5402,,LA GRAS TUBOUT,C515,56140,56159,Pleucadeuc,56,,,56159000ZM0217,,,,,,,,,,,,,0,1,Maison,120,5,S,sols,,,175,-2.377024,47.768226
2019-813179,2019-09-11,000001,Vente,90000,,,TERRES DE LA GRAS TUBOUT,B070,56140,56159,Pleucadeuc,56,,,56159000ZM0218,,,,,,,,,,,,,0,,,,,S,sols,,,1220,-2.377286,47.768192
2019-813179,2019-09-11,000001,Vente,90000,,,TERRES DE LA GRAS TUBOUT,B070,56140,56159,Pleucadeuc,56,,,56159000ZM0219,,,,,,,,,,,,,0,,,,,T,terres,,,13819,-2.378064,47.768637
2019-813179,2019-09-11,000001,Vente,90000,,,TERRES DE LA GRAS TUBOUT,B070,56140,56159,Pleucadeuc,56,,,56159000ZM0219,,,,,,,,,,,,,0,,,,,L,landes,,,3616,-2.378064,47.768637
2019-813179,2019-09-11,000001,Vente,90000,,,TERRES DE LA GRAS TUBOUT,B070,56140,56159,Pleucadeuc,56,,,56159000ZM0220,,,,,,,,,,,,,0,,,,,S,sols,,,2876,-2.376905,47.767887
2019-813179,2019-09-11,000001,Vente,90000,,,TERRES DE LA GRAS TUBOUT,B070,56140,56159,Pleucadeuc,56,,,56159000ZM0222,,,,,,,,,,,,,0,,,,,T,terres,,,661,-2.377048,47.767424
2019-813179,2019-09-11,000001,Vente,90000,,,TERRES DE LA GRAS TUBOUT,B070,56140,56159,Pleucadeuc,56,,,56159000ZM0222,,,,,,,,,,,,,0,,,,,T,terres,,,662,-2.377048,47.767424
2019-813179,2019-09-11,000001,Vente,90000,,,TERRES DE LA GRAS TUBOUT,B070,56140,56159,Pleucadeuc,56,,,56159000ZM0222,,,,,,,,,,,,,0,,,,,T,terres,,,661,-2.377048,47.767424
2019-813718,2019-09-23,000001,Vente,122000,24,,AV ST PIERRE,0160,56140,56159,Pleucadeuc,56,,,56159000ZP0092,,,,,,,,,,,,,0,1,Maison,141,7,S,sols,,,698,-2.373614,47.756217
2019-813830,2019-09-28,000001,Vente,140000,11,,RUE ST CADOC,0155,56140,56159,Pleucadeuc,56,,,56159000ZO0214,,,,,,,,,,,,,0,1,Maison,92,5,S,sols,,,685,-2.373799,47.7611
2019-814132,2019-10-09,000001,Vente,173620,7,,RUE JACQUES HERVIEU,0093,56140,56159,Pleucadeuc,56,,,56159000AI0485,,,,,,,,,,,,,0,1,Maison,122,4,S,sols,,,957,-2.371408,47.756525
2019-814132,2019-10-09,000001,Vente,173620,7,,RUE JACQUES HERVIEU,0093,56140,56159,Pleucadeuc,56,,,56159000AI0485,,,,,,,,,,,,,0,1,Maison,122,4,AG,terrains d'agrément,,,2076,-2.371408,47.756525
2019-814226,2019-10-25,000002,Vente,105000,5586,,PRIZIAC DE BAS,C511,56140,56159,Pleucadeuc,56,,,56159000ZM0229,,,,,,,,,,,,,0,1,Maison,110,6,J,jardins,,,1420,-2.364583,47.770918
2019-814226,2019-10-25,000002,Vente,105000,5586,,PRIZIAC DE BAS,C511,56140,56159,Pleucadeuc,56,,,56159000ZM0229,,,,,,,,,,,,,0,1,Maison,110,6,S,sols,,,500,-2.364583,47.770918
2019-814226,2019-10-25,000002,Vente,105000,,,TERRES DE PRIZIAC,B975,56140,56159,Pleucadeuc,56,,,56159000ZM0252,,,,,,,,,,,,,0,,,,,T,terres,,,266,-2.364698,47.770731
2019-814296,2019-10-21,000001,Vente,130000,,,LE BOURG,B150,56140,56159,Pleucadeuc,56,,,56159000AI0025,,,,,,,,,,,,,0,,,,,S,sols,,,25,-2.375925,47.75934
2019-814296,2019-10-21,000001,Vente,130000,1,,PL ANNE DE BRETAGNE,0003,56140,56159,Pleucadeuc,56,,,56159000AI0026,,,,,,,,,,,,,0,1,Maison,212,9,S,sols,,,91,-2.375963,47.759232
2019-814296,2019-10-21,000001,Vente,130000,1,,PL ANNE DE BRETAGNE,0003,56140,56159,Pleucadeuc,56,,,56159000AI0027,,,,,,,,,,,,,0,,,,,S,sols,,,112,-2.375888,47.75927
2019-814296,2019-10-21,000001,Vente,130000,,,LE BOURG,B150,56140,56159,Pleucadeuc,56,,,56159000AI0028,,,,,,,,,,,,,0,,,,,J,jardins,,,139,-2.375821,47.759359
2019-814296,2019-10-21,000001,Vente,130000,,,LE BOURG,B150,56140,56159,Pleucadeuc,56,,,56159000AI0423,,,,,,,,,,,,,0,,,,,S,sols,,,153,-2.375995,47.75932
2019-814296,2019-10-21,000001,Vente,130000,,,LE BOURG,B150,56140,56159,Pleucadeuc,56,,,56159000AI0425,,,,,,,,,,,,,0,,,,,J,jardins,,,83,-2.375813,47.759437
2019-814340,2019-10-14,000001,Vente,6500,,,KERCOUET,B709,56140,56159,Pleucadeuc,56,,,56159000AH0224,,,,,,,,,,,,,0,,,,,S,sols,,,7043,-2.38536,47.748791
2019-814340,2019-10-14,000001,Vente,6500,,,KERCOUET,B709,56140,56159,Pleucadeuc,56,,,56159000AH0226,,,,,,,,,,,,,0,,,,,S,sols,,,1833,-2.384924,47.74864
2019-814340,2019-10-14,000001,Vente,6500,,,KERCOUET,B709,56140,56159,Pleucadeuc,56,,,56159000AH0238,,,,,,,,,,,,,0,,,,,P,prés,,,355,-2.384531,47.74871
2019-814340,2019-10-14,000001,Vente,6500,,,KERCOUET,B709,56140,56159,Pleucadeuc,56,,,56159000AH0239,,,,,,,,,,,,,0,,,,,S,sols,,,2646,-2.384731,47.749223
2019-814340,2019-10-14,000001,Vente,6500,,,KERCOUET,B709,56140,56159,Pleucadeuc,56,,,56159000AH0242,,,,,,,,,,,,,0,,,,,S,sols,,,24,-2.385238,47.748169
2019-814340,2019-10-14,000001,Vente,6500,,,KERCOUET,B709,56140,56159,Pleucadeuc,56,,,56159000AH0244,,,,,,,,,,,,,0,,,,,S,sols,,,2596,-2.385368,47.748364
2019-814344,2019-10-18,000001,Vente,2800,,,KERCOUET,B709,56140,56159,Pleucadeuc,56,,,56159000AH0211,,,,,,,,,,,,,0,,,,,L,landes,,,1101,-2.379168,47.746833
2019-814344,2019-10-18,000001,Vente,2800,,,KERCOUET,B709,56140,56159,Pleucadeuc,56,,,56159000AH0212,,,,,,,,,,,,,0,,,,,L,landes,,,700,-2.379862,47.746952
2019-814344,2019-10-18,000001,Vente,2800,,,KERCOUET,B709,56140,56159,Pleucadeuc,56,,,56159000AH0214,,,,,,,,,,,,,0,,,,,BS,taillis sous futaie,,,11985,-2.379505,47.747295
2019-814831,2019-11-12,000001,Vente,18284,,,LA PIERRE AUX BASSINS,C111,56140,56159,Pleucadeuc,56,,,56159000ZP0425,,,,,,,,,,,,,0,,,,,AB,terrains a bâtir,,,653,-2.371546,47.752585
2019-814843,2019-10-31,000001,Vente,155000,5906,,LA TAYEE,C406,56140,56159,Pleucadeuc,56,,,56159000ZC0144,,,,,,,,,,,,,0,1,Maison,114,5,S,sols,,,815,-2.395852,47.784978
2019-815023,2019-11-19,000001,Vente,10000,,,DOMAINE DU TERTRE BOCAN,B519,56140,56159,Pleucadeuc,56,,,56159000ZM0200,,,,,,,,,,,,,0,,,,,S,sols,,,1891,-2.368449,47.765568
2019-815023,2019-11-19,000001,Vente,10000,,,DOMAINE DU TERTRE BOCAN,B519,56140,56159,Pleucadeuc,56,,,56159000ZM0201,,,,,,,,,,,,,0,,,,,S,sols,,,279,-2.368251,47.765485
2019-815023,2019-11-19,000001,Vente,10000,,,DOMAINE DU TERTRE BOCAN,B519,56140,56159,Pleucadeuc,56,,,56159000ZM0205,,,,,,,,,,,,,0,,,,,S,sols,,,102,-2.367996,47.765546
2019-815023,2019-11-19,000001,Vente,10000,,,DOMAINE DU TERTRE BOCAN,B519,56140,56159,Pleucadeuc,56,,,56159000ZM0207,,,,,,,,,,,,,0,,,,,S,sols,,,175,-2.36849,47.765404
2019-815278,2019-11-27,000001,Vente,15848,,,LA PIERRE AUX BASSINS,C111,56140,56159,Pleucadeuc,56,,,56159000ZP0419,,,,,,,,,,,,,0,,,,,AB,terrains a bâtir,,,566,-2.372443,47.752637
2019-815771,2019-12-12,000001,Vente,109125,,,TERRES DE LA FREGONNAIS,C506,56140,56159,Pleucadeuc,56,,,56159000ZT0092,,,,,,,,,,,,,0,,,,,S,sols,,,90,-2.400349,47.767395
2019-815771,2019-12-12,000001,Vente,109125,5260,,LA FREGONNAIS,B550,56140,56159,Pleucadeuc,56,,,56159000ZT0104,,,,,,,,,,,,,0,1,Maison,60,2,S,sols,,,600,-2.400576,47.767192
2019-815773,2019-12-17,000001,Vente,55000,30,,RUE DES SAPINIERES,0168,56140,56159,Pleucadeuc,56,,,56159000ZP0244,,,,,,,,,,,,,0,,,,,AB,terrains a bâtir,,,1000,,
2019-815773,2019-12-17,000001,Vente,55000,30,,RUE DES SAPINIERES,0168,56140,56159,Pleucadeuc,56,,,56159000ZP0244,,,,,,,,,,,,,0,,,,,T,terres,,,2809,,
2019-815863,2019-12-23,000001,Vente,19572,,,LA PIERRE AUX BASSINS,C111,56140,56159,Pleucadeuc,56,,,56159000ZP0411,,,,,,,,,,,,,0,,,,,AB,terrains a bâtir,,,145,-2.371906,47.75292
2019-815863,2019-12-23,000001,Vente,19572,,,LA PIERRE AUX BASSINS,C111,56140,56159,Pleucadeuc,56,,,56159000ZP0435,,,,,,,,,,,,,0,,,,,AB,terrains a bâtir,,,554,-2.371909,47.753063
2019-815865,2019-12-16,000001,Vente,600,,,GRENY,B659,56140,56159,Pleucadeuc,56,,,56159000ZR0086,,,,,,,,,,,,,0,,,,,P,prés,,,8000,,
2019-815904,2019-12-26,000001,Vente,29000,,,LE BOURG,B150,56140,56159,Pleucadeuc,56,,,56159000AI0717,,,,,,,,,,,,,0,,,,,S,sols,,,225,-2.377501,47.756643
2019-815904,2019-12-26,000001,Vente,29000,,,LE BOURG,B150,56140,56159,Pleucadeuc,56,,,56159000AI0718,,,,,,,,,,,,,0,,,,,S,sols,,,18,-2.377385,47.756652
2019-815904,2019-12-26,000001,Vente,29000,,,LE BOURG,B150,56140,56159,Pleucadeuc,56,,,56159000AI0726,,,,,,,,,,,,,0,,,,,T,terres,,,479,-2.377554,47.756733
2019-815904,2019-12-26,000001,Vente,29000,,,LE BOURG,B150,56140,56159,Pleucadeuc,56,,,56159000AI0730,,,,,,,,,,,,,0,,,,,J,jardins,,,5,-2.377424,47.75668
2019-816059,2019-12-12,000002,Echange,15,,,AV DE PARIS,0140,56140,56159,Pleucadeuc,56,,,56159000AI0782,,,,,,,,,,,,,0,,,,,S,sols,,,14,-2.376704,47.761023
2019-816059,2019-12-12,000003,Echange,15,,,LE BOURG,B150,56140,56159,Pleucadeuc,56,,,56159000AI0780,,,,,,,,,,,,,0,,,,,J,jardins,,,1,,
2019-816059,2019-12-12,000003,Echange,15,,,LE BOURG,B150,56140,56159,Pleucadeuc,56,,,56159000AI0784,,,,,,,,,,,,,0,,,,,T,terres,,,9,-2.37655,47.760921
2019-816059,2019-12-12,000003,Echange,15,,,LE BOURG,B150,56140,56159,Pleucadeuc,56,,,56159000AI0786,,,,,,,,,,,,,0,,,,,T,terres,,,4,-2.376403,47.760737
2019-816348,2019-10-08,000001,Adjudication,151000,,,LES LANDIERS,B834,56140,56159,Pleucadeuc,56,,,56159000AR0094,,,,,,,,,,,,,0,,,,,P,prés,,,1972,-2.378483,47.798231
2019-816348,2019-10-08,000001,Adjudication,151000,,,LES LANDIERS,B834,56140,56159,Pleucadeuc,56,,,56159000AR0098,,,,,,,,,,,,,0,,,,,BR,futaies résineuses,,,539,-2.379891,47.798883
2019-816348,2019-10-08,000001,Adjudication,151000,,,LES LANDIERS,B834,56140,56159,Pleucadeuc,56,,,56159000AR0099,,,,,,,,,,,,,0,,,,,T,terres,,,11348,-2.379558,47.799473
2019-816348,2019-10-08,000001,Adjudication,151000,,,LES LANDIERS,B834,56140,56159,Pleucadeuc,56,,,56159000AR0101,,,,,,,,,,,,,0,,,,,P,prés,,,691,-2.378453,47.800189
2019-816348,2019-10-08,000001,Adjudication,151000,,,LES LANDIERS,B834,56140,56159,Pleucadeuc,56,,,56159000AR0167,,,,,,,,,,,,,0,,,,,BR,futaies résineuses,,,16,-2.378056,47.798371
2019-816348,2019-10-08,000001,Adjudication,151000,,,LES LANDIERS,B834,56140,56159,Pleucadeuc,56,,,56159000AR0168,,,,,,,,,,,,,0,,,,,BR,futaies résineuses,,,571,-2.378232,47.798165
2019-816348,2019-10-08,000001,Adjudication,151000,,,LES LANDIERS,B834,56140,56159,Pleucadeuc,56,,,56159000AR0171,,,,,,,,,,,,,0,,,,,P,prés,,,5037,-2.378447,47.799089
2019-816348,2019-10-08,000001,Adjudication,151000,,,LES LANDIERS,B834,56140,56159,Pleucadeuc,56,,,56159000AR0173,,,,,,,,,,,,,0,,,,,P,prés,,,7228,-2.37861,47.799586
2019-816348,2019-10-08,000001,Adjudication,151000,5319,,LA COMBE,B388,56140,56159,Pleucadeuc,56,,,56159000AR0174,,,,,,,,,,,,,0,4,Local industriel. commercial ou assimilé,121,0,S,sols,,,4334,-2.379209,47.798578
2019-816348,2019-10-08,000001,Adjudication,151000,5319,,LA COMBE,B388,56140,56159,Pleucadeuc,56,,,56159000AR0174,,,,,,,,,,,,,0,4,Local industriel. commercial ou assimilé,324,0,S,sols,,,4334,-2.379209,47.798578
2019-816348,2019-10-08,000001,Adjudication,151000,5319,,LA COMBE,B388,56140,56159,Pleucadeuc,56,,,56159000AR0174,,,,,,,,,,,,,0,4,Local industriel. commercial ou assimilé,295,0,S,sols,,,4334,-2.379209,47.798578
2019-816348,2019-10-08,000001,Adjudication,151000,5319,,LA COMBE,B388,56140,56159,Pleucadeuc,56,,,56159000AR0174,,,,,,,,,,,,,0,2,Appartement,71,2,S,sols,,,4334,-2.379209,47.798578
2019-816348,2019-10-08,000001,Adjudication,151000,,,LES LANDIERS,B834,56140,56159,Pleucadeuc,56,,,56159000AR0178,,,,,,,,,,,,,0,,,,,T,terres,,,689,-2.379548,47.798555
