id_mutation,date_mutation,numero_disposition,nature_mutation,valeur_fonciere,adresse_numero,adresse_suffixe,adresse_nom_voie,adresse_code_voie,code_postal,code_commune,nom_commune,code_departement,ancien_code_commune,ancien_nom_commune,id_parcelle,ancien_id_parcelle,numero_volume,lot1_numero,lot1_surface_carrez,lot2_numero,lot2_surface_carrez,lot3_numero,lot3_surface_carrez,lot4_numero,lot4_surface_carrez,lot5_numero,lot5_surface_carrez,nombre_lots,code_type_local,type_local,surface_reelle_bati,nombre_pieces_principales,code_nature_culture,nature_culture,code_nature_culture_speciale,nature_culture_speciale,surface_terrain,longitude,latitude
2019-960869,2019-01-04,000001,Vente,182200,7,,IMP DU PIC DU MIDI,0159,64510,64133,Boeil-Bezing,64,,,641330000B1219,,,,,,,,,,,,,0,1,Maison,106,5,S,sols,,,1003,-0.267061,43.226353
2019-960971,2019-01-25,000001,Vente,67747.6,41,T,RUE HENRI IV,0110,64510,64133,Boeil-Bezing,64,,,641330000B1293,,,8,,,,,,,,,,1,3,Dépendance,,0,,,,,,-0.271891,43.226414
2019-960971,2019-01-25,000001,Vente,67747.6,41,T,RUE HENRI IV,0110,64510,64133,Boeil-Bezing,64,,,641330000B1293,,,33,44.8,,,,,,,,,1,2,Appartement,45,2,,,,,,-0.271891,43.226414
2019-960971,2019-01-25,000001,Vente,67747.6,41,T,RUE HENRI IV,0110,64510,64133,Boeil-Bezing,64,,,641330000B1293,,,7,,,,,,,,,,1,3,Dépendance,,0,,,,,,-0.271891,43.226414
2019-961144,2019-03-19,000001,Vente,16000,,,LALANNE,B170,64510,64133,Boeil-Bezing,64,,,641330000A0108,,,,,,,,,,,,,0,,,,,P,prés,,,5662,-0.208482,43.249707
2019-961144,2019-03-19,000001,Vente,16000,,,LALANNE,B170,64510,64133,Boeil-Bezing,64,,,641330000A0109,,,,,,,,,,,,,0,,,,,T,terres,,,7719,-0.207825,43.249691
2019-961182,2019-03-25,000001,Vente,200000,5,,CLOS DES MYOSOTIS,A050,64510,64133,Boeil-Bezing,64,,,641330000C0321,,,,,,,,,,,,,0,1,Maison,88,4,S,sols,,,704,-0.270646,43.228159
2019-961187,2019-03-07,000001,Vente,135500,2,,LOT LES PLATANES,A070,64510,64133,Boeil-Bezing,64,,,641330000B1150,,,,,,,,,,,,,0,1,Maison,77,3,S,sols,,,1005,-0.253508,43.217646
2019-961353,2019-05-07,000001,Vente,175000,9339,,CLOS DES MAGNOLIAS,A045,64510,64133,Boeil-Bezing,64,,,641330000C0339,,,,,,,,,,,,,0,1,Maison,95,5,S,sols,,,728,-0.270331,43.229579
2019-961384,2019-05-20,000001,Vente,2000,,,LAS COUDURES,B108,64510,64133,Boeil-Bezing,64,,,64133000ZC0056,,,,,,,,,,,,,0,,,,,T,terres,,,2025,-0.260228,43.218328
2019-961585,2019-06-18,000001,Vente,180000,7,,LOT LES PLATANES,A070,64510,64133,Boeil-Bezing,64,,,641330000B1153,,,,,,,,,,,,,0,1,Maison,117,4,S,sols,,,1088,-0.253702,43.218453
2019-961587,2019-06-28,000001,Vente,176000,,,LOT LES CAPUCINES,A017,64510,64133,Boeil-Bezing,64,,,641330000B1578,,,,,,,,,,,,,0,,,,,S,sols,,,1,-0.262281,43.215727
2019-961587,2019-06-28,000001,Vente,176000,112,,LOT LES CAPUCINES,A017,64510,64133,Boeil-Bezing,64,,,641330000B1582,,,,,,,,,,,,,0,1,Maison,82,4,S,sols,,,427,-0.262138,43.215709
2019-961599,2019-06-13,000001,Vente,12000,9,,RUE DU MARECHAL FERRANT,0140,64510,64133,Boeil-Bezing,64,,,641330000B0908,,,,,,,,,,,,,0,1,Maison,175,6,S,sols,,,785,-0.265227,43.223612
2019-961599,2019-06-13,000001,Vente,12000,9,,RUE DU MARECHAL FERRANT,0140,64510,64133,Boeil-Bezing,64,,,641330000B0908,,,,,,,,,,,,,0,1,Maison,175,6,J,jardins,,,805,-0.265227,43.223612
2019-961691,2019-06-28,000001,Vente,330000,13,,RUE HENRI IV,0110,64510,64133,Boeil-Bezing,64,,,641330000B0419,,,,,,,,,,,,,0,1,Maison,108,4,S,sols,,,600,-0.267799,43.222708
2019-961691,2019-06-28,000001,Vente,330000,13,,RUE HENRI IV,0110,64510,64133,Boeil-Bezing,64,,,641330000B0419,,,,,,,,,,,,,0,1,Maison,102,4,S,sols,,,600,-0.267799,43.222708
2019-961691,2019-06-28,000001,Vente,330000,13,,RUE HENRI IV,0110,64510,64133,Boeil-Bezing,64,,,641330000B0419,,,,,,,,,,,,,0,4,Local industriel. commercial ou assimilé,40,0,S,sols,,,600,-0.267799,43.222708
2019-961691,2019-06-28,000001,Vente,330000,9420,,RUE DU GABIZOS,0070,64510,64133,Boeil-Bezing,64,,,641330000B0420,,,,,,,,,,,,,0,2,Appartement,65,3,S,sols,,,495,-0.268044,43.222553
2019-961691,2019-06-28,000001,Vente,330000,9882,,RUE DU GABIZOS,0070,64510,64133,Boeil-Bezing,64,,,641330000B0882,,,,,,,,,,,,,0,2,Appartement,60,3,S,sols,,,216,-0.26792,43.222755
2019-961756,2019-07-25,000001,Vente,65000,,,CAMY DE BANDA,B059,64510,64133,Boeil-Bezing,64,,,641330000B1310,,,,,,,,,,,,,0,,,,,AB,terrains a bâtir,,,382,-0.252073,43.222522
2019-961756,2019-07-25,000001,Vente,65000,,,CAMY DE BANDA,B059,64510,64133,Boeil-Bezing,64,,,641330000B1311,,,,,,,,,,,,,0,,,,,AB,terrains a bâtir,,,90,-0.251711,43.222369
2019-961756,2019-07-25,000001,Vente,65000,,,CAMY DE BANDA,B059,64510,64133,Boeil-Bezing,64,,,641330000B1338,,,,,,,,,,,,,0,,,,,AB,terrains a bâtir,,,1164,-0.252377,43.222352
2019-961885,2019-08-26,000001,Vente,,,,LOT LE BALAITOUS,A005,64510,64133,Boeil-Bezing,64,,,641330000C0372,,,,,,,,,,,,,0,,,,,AB,terrains a bâtir,,,372,,
2019-961972,2019-08-20,000001,Vente,267900,,,DOU CAMI DE NAY,B126,64510,64133,Boeil-Bezing,64,,,641330000B0592,,,,,,,,,,,,,0,,,,,J,jardins,,,543,-0.264336,43.216366
2019-961972,2019-08-20,000001,Vente,267900,30,,RUE DES PYRENEES,0180,64510,64133,Boeil-Bezing,64,,,641330000B0593,,,,,,,,,,,,,0,1,Maison,130,4,S,sols,,,303,-0.264383,43.216634
2019-962073,2019-09-20,000001,Vente,227000,58,,RUE DES TULIPES,0191,64510,64133,Boeil-Bezing,64,,,641330000C0411,,,,,,,,,,,,,0,1,Maison,97,4,S,sols,,,815,-0.274874,43.230481
2019-962126,2019-09-30,000001,Vente,15000,9159,,RUE CARL EINSTEIN,0063,64510,64133,Boeil-Bezing,64,,,641330000B1612,,,,,,,,,,,,,0,1,Maison,90,5,,,,,,-0.266204,43.214787
2019-962139,2019-10-08,000001,Vente,180700,,,LAS COUDURES,B108,64510,64133,Boeil-Bezing,64,,,641330000B1096,,,,,,,,,,,,,0,,,,,S,sols,,,49,-0.254565,43.216101
2019-962139,2019-10-08,000001,Vente,180700,1,,LOT LE BEARN,A010,64510,64133,Boeil-Bezing,64,,,641330000B1097,,,,,,,,,,,,,0,1,Maison,99,5,S,sols,,,951,-0.254835,43.216051
2019-962168,2019-10-10,000001,Vente,195000,25,,RUE HENRI IV,0110,64510,64133,Boeil-Bezing,64,,,641330000B0463,,,,,,,,,,,,,0,2,Appartement,26,1,S,sols,,,1226,,
2019-962168,2019-10-10,000001,Vente,195000,25,,RUE HENRI IV,0110,64510,64133,Boeil-Bezing,64,,,641330000B0463,,,,,,,,,,,,,0,2,Appartement,32,2,S,sols,,,1226,,
2019-962168,2019-10-10,000001,Vente,195000,25,,RUE HENRI IV,0110,64510,64133,Boeil-Bezing,64,,,641330000B0463,,,,,,,,,,,,,0,2,Appartement,56,3,S,sols,,,1226,,
2019-962168,2019-10-10,000001,Vente,195000,25,,RUE HENRI IV,0110,64510,64133,Boeil-Bezing,64,,,641330000B0463,,,,,,,,,,,,,0,2,Appartement,133,3,S,sols,,,1226,,
2019-962168,2019-10-10,000001,Vente,195000,25,,RUE HENRI IV,0110,64510,64133,Boeil-Bezing,64,,,641330000B0463,,,,,,,,,,,,,0,2,Appartement,23,1,S,sols,,,1226,,
2019-962168,2019-10-10,000001,Vente,195000,,,CAPBAT,B069,64510,64133,Boeil-Bezing,64,,,641330000B0464,,,,,,,,,,,,,0,,,,,J,jardins,,,1330,-0.269772,43.224152
2019-962285,2019-11-07,000001,Vente,1300,,,DOU CAMI DE NAY,B126,64510,64133,Boeil-Bezing,64,,,641330000B0551,,,,,,,,,,,,,0,,,,,J,jardins,,,686,-0.260273,43.215383
2019-962297,2019-11-13,000001,Vente,180000,2,,IMP DE LA VALLEE D OSSAU,0200,64510,64133,Boeil-Bezing,64,,,641330000D0191,,,,,,,,,,,,,0,1,Maison,87,4,S,sols,,,1022,-0.272765,43.226686
2019-962309,2019-11-21,000001,Vente,50000,7,,CLOS DES CAMELIAS,A004,64510,64133,Boeil-Bezing,64,,,641330000B1562,,,,,,,,,,,,,0,,,,,AB,terrains a bâtir,,,604,-0.266004,43.223856
2019-962310,2019-11-12,000001,Vente,4720,,,COUTELLOT,B113,64510,64133,Boeil-Bezing,64,,,641330000B1625,,,,,,,,,,,,,0,,,,,T,terres,,,1,-0.263538,43.22024
2019-962310,2019-11-12,000001,Vente,4720,,,COUTELLOT,B113,64510,64133,Boeil-Bezing,64,,,641330000B1627,,,,,,,,,,,,,0,,,,,T,terres,,,58,-0.263483,43.22029
2019-962457,2019-12-13,000003,Vente,35000,22,B,RUE DES PYRENEES,0180,64510,64133,Boeil-Bezing,64,,,641330000B0885,,,,,,,,,,,,,0,3,Dépendance,,0,S,sols,,,60,-0.265251,43.218456
2019-962457,2019-12-13,000003,Vente,35000,22,,RUE DES PYRENEES,0180,64510,64133,Boeil-Bezing,64,,,641330000B1640,,,,,,,,,,,,,0,2,Appartement,204,9,S,sols,,,211,-0.265323,43.218509
2019-962457,2019-12-13,000003,Vente,35000,22,,RUE DES PYRENEES,0180,64510,64133,Boeil-Bezing,64,,,641330000B1640,,,,,,,,,,,,,0,3,Dépendance,,0,S,sols,,,211,-0.265323,43.218509
2019-962457,2019-12-13,000003,Vente,35000,22,,RUE DES PYRENEES,0180,64510,64133,Boeil-Bezing,64,,,641330000B1642,,,,,,,,,,,,,0,,,,,S,sols,,,175,-0.26546,43.218605
2019-962473,2019-12-27,000001,Vente,198000,9,,RUE DES COTEAUX,0050,64510,64133,Boeil-Bezing,64,,,641330000C0190,,,,,,,,,,,,,0,1,Maison,139,5,S,sols,,,760,-0.270408,43.227668
2019-962473,2019-12-27,000001,Vente,198000,9,,RUE DES COTEAUX,0050,64510,64133,Boeil-Bezing,64,,,641330000C0190,,,,,,,,,,,,,0,1,Maison,139,5,T,terres,,,964,-0.270408,43.227668
