id_mutation,date_mutation,numero_disposition,nature_mutation,valeur_fonciere,adresse_numero,adresse_suffixe,adresse_nom_voie,adresse_code_voie,code_postal,code_commune,nom_commune,code_departement,ancien_code_commune,ancien_nom_commune,id_parcelle,ancien_id_parcelle,numero_volume,lot1_numero,lot1_surface_carrez,lot2_numero,lot2_surface_carrez,lot3_numero,lot3_surface_carrez,lot4_numero,lot4_surface_carrez,lot5_numero,lot5_surface_carrez,nombre_lots,code_type_local,type_local,surface_reelle_bati,nombre_pieces_principales,code_nature_culture,nature_culture,code_nature_culture_speciale,nature_culture_speciale,surface_terrain,longitude,latitude
2019-956297,2019-05-21,000001,Vente,1500,,,DU HAMEAU,B023,64350,64182,Castillon (Canton de Lembeye),64,,,641820000B0229,,,,,,,,,,,,,0,,,,,BT,taillis simples,,,9235,-0.135539,43.481044
2019-958136,2019-08-13,000001,Vente,99000,9,,CHE DE LA VISION,0180,64350,64182,Castillon (Canton de Lembeye),64,,,641820000B0450,,,,,,,,,,,,,0,1,Maison,88,4,S,sols,,,500,-0.140202,43.485152
2019-958136,2019-08-13,000001,Vente,99000,9,,CHE DE LA VISION,0180,64350,64182,Castillon (Canton de Lembeye),64,,,641820000B0450,,,,,,,,,,,,,0,1,Maison,88,4,J,jardins,,,900,-0.140202,43.485152
2019-960416,2019-12-13,000001,Vente,182300,,,VISION,B063,64350,64182,Castillon (Canton de Lembeye),64,,,641820000B0161,,,,,,,,,,,,,0,,,,,BT,taillis simples,,,5180,-0.140585,43.484079
2019-960416,2019-12-13,000001,Vente,182300,,,VISION,B063,64350,64182,Castillon (Canton de Lembeye),64,,,641820000B0386,,,,,,,,,,,,,0,,,,,BT,taillis simples,,,7378,-0.140699,43.484941
2019-960416,2019-12-13,000001,Vente,182300,,,VISION,B063,64350,64182,Castillon (Canton de Lembeye),64,,,641820000B0387,,,,,,,,,,,,,0,,,,,BT,taillis simples,,,582,-0.141304,43.484994
2019-960416,2019-12-13,000001,Vente,182300,,,VISION,B063,64350,64182,Castillon (Canton de Lembeye),64,,,641820000B0388,,,,,,,,,,,,,0,,,,,T,terres,,,174,-0.141665,43.485487
2019-960416,2019-12-13,000001,Vente,182300,,,VISION,B063,64350,64182,Castillon (Canton de Lembeye),64,,,641820000B0389,,,,,,,,,,,,,0,,,,,T,terres,,,606,-0.141536,43.485454
2019-960416,2019-12-13,000001,Vente,182300,,,VISION,B063,64350,64182,Castillon (Canton de Lembeye),64,,,641820000B0390,,,,,,,,,,,,,0,,,,,L,landes,PATUR,Pâture plantée,210,-0.141296,43.485559
2019-960416,2019-12-13,000001,Vente,182300,,,VISION,B063,64350,64182,Castillon (Canton de Lembeye),64,,,641820000B0391,,,,,,,,,,,,,0,,,,,L,landes,PATUR,Pâture plantée,1090,-0.141391,43.485727
2019-960416,2019-12-13,000001,Vente,182300,11,,CHE DE LA VISION,0180,64350,64182,Castillon (Canton de Lembeye),64,,,641820000B0392,,,,,,,,,,,,,0,1,Maison,86,3,J,jardins,,,1075,-0.140667,43.485826
2019-960416,2019-12-13,000001,Vente,182300,11,,CHE DE LA VISION,0180,64350,64182,Castillon (Canton de Lembeye),64,,,641820000B0392,,,,,,,,,,,,,0,1,Maison,86,3,S,sols,,,339,-0.140667,43.485826
2019-960416,2019-12-13,000001,Vente,182300,,,VISION,B063,64350,64182,Castillon (Canton de Lembeye),64,,,641820000B0393,,,,,,,,,,,,,0,,,,,T,terres,,,2956,-0.140865,43.485481
