id_mutation,date_mutation,numero_disposition,nature_mutation,valeur_fonciere,adresse_numero,adresse_suffixe,adresse_nom_voie,adresse_code_voie,code_postal,code_commune,nom_commune,code_departement,ancien_code_commune,ancien_nom_commune,id_parcelle,ancien_id_parcelle,numero_volume,lot1_numero,lot1_surface_carrez,lot2_numero,lot2_surface_carrez,lot3_numero,lot3_surface_carrez,lot4_numero,lot4_surface_carrez,lot5_numero,lot5_surface_carrez,nombre_lots,code_type_local,type_local,surface_reelle_bati,nombre_pieces_principales,code_nature_culture,nature_culture,code_nature_culture_speciale,nature_culture_speciale,surface_terrain,longitude,latitude
2019-961127,2019-03-19,000001,Vente,82000,,,VILLAGE,B277,64260,64463,Rébénacq,64,,,644630000B0218,,,,,,,,,,,,,0,,,,,J,jardins,,,330,-0.399628,43.157466
2019-961127,2019-03-19,000001,Vente,82000,9,,CHE DE LA GARENNE,0500,64260,64463,Rébénacq,64,,,644630000B0222,,,,,,,,,,,,,0,1,Maison,161,4,S,sols,,,70,-0.399681,43.157733
2019-961127,2019-03-19,000001,Vente,82000,,,VILLAGE,B277,64260,64463,Rébénacq,64,,,644630000B0771,,,,,,,,,,,,,0,,,,,S,sols,,,16,-0.399569,43.157411
2019-961127,2019-03-19,000001,Vente,82000,,,VILLAGE,B277,64260,64463,Rébénacq,64,,,644630000B0793,,,,,,,,,,,,,0,,,,,S,sols,,,29,-0.399726,43.157711
2019-961235,2019-03-28,000001,Vente,150000,11,,RUE SAINT ESTEBEN,0760,64260,64463,Rébénacq,64,,,644630000B0968,,,,,,,,,,,,,0,1,Maison,75,3,S,sols,,,1037,-0.393305,43.156233
2019-961445,2019-05-27,000001,Vente,187000,,,VILLAGE,B277,64260,64463,Rébénacq,64,,,644630000B0243,,,,,,,,,,,,,0,,,,,J,jardins,,,200,-0.398356,43.158487
2019-961445,2019-05-27,000001,Vente,187000,12,,RTE DE LARUNS,0580,64260,64463,Rébénacq,64,,,644630000B0244,,,,,,,,,,,,,0,1,Maison,144,4,S,sols,,,130,-0.398251,43.158541
2019-961445,2019-05-27,000001,Vente,187000,,,VILLAGE,B277,64260,64463,Rébénacq,64,,,644630000B0245,,,,,,,,,,,,,0,,,,,L,landes,VAGUE,Terrain vague,80,-0.398148,43.158614
2019-961445,2019-05-27,000001,Vente,187000,,,VILLAGE,B277,64260,64463,Rébénacq,64,,,644630000B1174,,,,,,,,,,,,,0,,,,,J,jardins,,,316,-0.398099,43.158739
2019-961445,2019-05-27,000001,Vente,187000,,,VILLAGE,B277,64260,64463,Rébénacq,64,,,644630000B1175,,,,,,,,,,,,,0,,,,,E,eaux,CANAL,Canal,53,-0.398305,43.158618
2019-961837,2019-07-02,000001,Vente,10200,,,MARTY,B199,64260,64463,Rébénacq,64,,,644630000A0698,,,,,,,,,,,,,0,,,,,LB,landes boisées,TOUYA,Touyas,5200,-0.386944,43.157856
2019-961837,2019-07-02,000001,Vente,10200,,,ESTEBEN,B126,64260,64463,Rébénacq,64,,,644630000B0364,,,,,,,,,,,,,0,,,,,P,prés,,,30240,-0.388621,43.155852
2019-962175,2019-10-18,000001,Vente,167000,5,,PL DE LA HAUTE BIELLE,0530,64260,64463,Rébénacq,64,,,644630000B0129,,,,,,,,,,,,,0,1,Maison,72,3,S,sols,,,128,-0.395588,43.156902
2019-962175,2019-10-18,000001,Vente,167000,,,VILLAGE,B277,64260,64463,Rébénacq,64,,,644630000B0130,,,,,,,,,,,,,0,,,,,J,jardins,,,427,-0.395485,43.15695
2019-962175,2019-10-18,000001,Vente,167000,,,VILLAGE,B277,64260,64463,Rébénacq,64,,,644630000B0136,,,,,,,,,,,,,0,,,,,P,prés,,,1085,-0.395181,43.157223
2019-962315,2019-11-22,000001,Vente,229800,5,,PL DE LA MAIRIE,0630,64260,64463,Rébénacq,64,,,644630000B0283,,,,,,,,,,,,,0,2,Appartement,91,3,S,sols,,,265,-0.396938,43.159949
2019-962315,2019-11-22,000001,Vente,229800,5,,PL DE LA MAIRIE,0630,64260,64463,Rébénacq,64,,,644630000B0283,,,,,,,,,,,,,0,2,Appartement,160,6,S,sols,,,265,-0.396938,43.159949
2019-962315,2019-11-22,000001,Vente,229800,,,VILLAGE,B277,64260,64463,Rébénacq,64,,,644630000B0284,,,,,,,,,,,,,0,,,,,J,jardins,,,313,-0.397025,43.159976
2019-962357,2019-10-24,000001,Vente,96000,,,VILLAGE,B277,64260,64463,Rébénacq,64,,,644630000B0320,,,,,,,,,,,,,0,,,,,J,jardins,,,773,-0.397192,43.160986
2019-962357,2019-10-24,000001,Vente,96000,8,,RTE DE PAU,0700,64260,64463,Rébénacq,64,,,644630000B0321,,,,,,,,,,,,,0,1,Maison,121,3,S,sols,,,715,-0.397358,43.160897
2019-962482,2019-12-20,000001,Vente,187300,,,VILLAGE,B277,64260,64463,Rébénacq,64,,,644630000B0185,,,,,,,,,,,,,0,,,,,J,jardins,,,400,-0.39737,43.158067
2019-962482,2019-12-20,000001,Vente,187300,24,,PL DE LA BIELLE,0340,64260,64463,Rébénacq,64,,,644630000B0187,,,,,,,,,,,,,0,1,Maison,91,3,S,sols,,,177,-0.397171,43.158162
2019-962485,2019-12-19,000001,Vente,193000,5,,IMP DE BRUGES,0390,64260,64463,Rébénacq,64,,,644630000B0048,,,,,,,,,,,,,0,1,Maison,160,5,J,jardins,,,2995,-0.393854,43.158288
2019-962485,2019-12-19,000001,Vente,193000,5,,IMP DE BRUGES,0390,64260,64463,Rébénacq,64,,,644630000B0048,,,,,,,,,,,,,0,1,Maison,160,5,S,sols,,,810,-0.393854,43.158288
