id_mutation,date_mutation,numero_disposition,nature_mutation,valeur_fonciere,adresse_numero,adresse_suffixe,adresse_nom_voie,adresse_code_voie,code_postal,code_commune,nom_commune,code_departement,ancien_code_commune,ancien_nom_commune,id_parcelle,ancien_id_parcelle,numero_volume,lot1_numero,lot1_surface_carrez,lot2_numero,lot2_surface_carrez,lot3_numero,lot3_surface_carrez,lot4_numero,lot4_surface_carrez,lot5_numero,lot5_surface_carrez,nombre_lots,code_type_local,type_local,surface_reelle_bati,nombre_pieces_principales,code_nature_culture,nature_culture,code_nature_culture_speciale,nature_culture_speciale,surface_terrain,longitude,latitude
2019-1315271,2019-01-29,000001,Vente,500,,,LES PETITS BARBOTEAUX,B047,86230,86162,Mondion,86,,,86162000ZA0034,,,,,,,,,,,,,0,,,,,BT,taillis simples,,,1535,0.457052,46.943942
2019-1315579,2019-04-04,000001,Vente,185000,,,SAPINS DE MONTLABEUR,B058,86230,86162,Mondion,86,,,861620000A0028,,,,,,,,,,,,,0,,,,,BR,futaies résineuses,,,5655,0.447901,46.934205
2019-1315579,2019-04-04,000001,Vente,185000,,,LA MAITRIE,B036,86230,86162,Mondion,86,,,86162000ZA0083,,,,,,,,,,,,,0,,,,,BR,futaies résineuses,,,6095,0.456491,46.939953
2019-1315579,2019-04-04,000001,Vente,185000,,,LA MAITRIE,B036,86230,86162,Mondion,86,,,86162000ZA0084,,,,,,,,,,,,,0,,,,,BR,futaies résineuses,,,9730,0.45593,46.938685
2019-1315579,2019-04-04,000001,Vente,185000,,,LA MAITRIE,B036,86230,86162,Mondion,86,,,86162000ZA0086,,,,,,,,,,,,,0,,,,,BR,futaies résineuses,,,4970,0.454279,46.939263
2019-1315579,2019-04-04,000001,Vente,185000,5060,,LA CARTE,B015,86230,86162,Mondion,86,,,86162000ZE0039,,,,,,,,,,,,,0,1,Maison,98,3,S,sols,,,1680,0.483271,46.929536
2019-1315579,2019-04-04,000001,Vente,185000,,,LA CARTE,B015,86230,86162,Mondion,86,,,86162000ZE0046,,,,,,,,,,,,,0,,,,,T,terres,,,120,0.483238,46.929377
2019-1315579,2019-04-04,000001,Vente,185000,,,LA CARTE,B015,86230,86162,Mondion,86,,,86162000ZE0058,,,,,,,,,,,,,0,,,,,T,terres,,,123582,0.484808,46.929257
2019-1315579,2019-04-04,000001,Vente,185000,,,LA CARTE,B015,86230,86162,Mondion,86,,,86162000ZH0017,,,,,,,,,,,,,0,,,,,T,terres,,,9710,0.481659,46.930248
2019-1315579,2019-04-04,000001,Vente,185000,,,LA CARTE,B015,86230,86162,Mondion,86,,,86162000ZH0017,,,,,,,,,,,,,0,,,,,T,terres,,,38820,0.481659,46.930248
2019-1315579,2019-04-04,000001,Vente,185000,,,LA CARTE,B015,86230,86162,Mondion,86,,,86162000ZH0017,,,,,,,,,,,,,0,,,,,T,terres,,,4440,0.481659,46.930248
2019-1315579,2019-04-04,000001,Vente,185000,,,LA CARTE,B015,86230,86162,Mondion,86,,,86162000ZH0017,,,,,,,,,,,,,0,,,,,T,terres,,,48530,0.481659,46.930248
2019-1315579,2019-04-04,000001,Vente,185000,,,LA CARTE,B015,86230,86162,Mondion,86,,,86162000ZH0036,,,,,,,,,,,,,0,,,,,S,sols,,,293,0.482925,46.929698
2019-1315579,2019-04-04,000001,Vente,185000,,,LE BOIS D ANCENE,B004,86230,86162,Mondion,86,,,86162000ZI0096,,,,,,,,,,,,,0,,,,,BR,futaies résineuses,,,1330,0.464609,46.936523
2019-1315579,2019-04-04,000001,Vente,185000,,,LE BOIS D ANCENE,B004,86230,86162,Mondion,86,,,86162000ZI0097,,,,,,,,,,,,,0,,,,,BR,futaies résineuses,,,1265,0.464553,46.936594
2019-1316395,2019-08-23,000001,Vente,45000,5073,,LE CHATAIGNIER,B021,86230,86162,Mondion,86,,,86162000ZI0052,,,,,,,,,,,,,0,1,Maison,32,0,S,sols,,,305,0.474077,46.936823
2019-1316395,2019-08-23,000001,Vente,45000,,,LA CASSINE,B016,86230,86162,Mondion,86,,,86162000ZI0069,,,,,,,,,,,,,0,,,,,S,sols,,,15,0.47423,46.936628
2019-1316395,2019-08-23,000001,Vente,45000,5018,,LA CASSINE,B016,86230,86162,Mondion,86,,,86162000ZI0070,,,,,,,,,,,,,0,1,Maison,67,2,S,sols,,,270,0.474246,46.936564
2019-1316395,2019-08-23,000001,Vente,45000,,,LA CASSINE,B016,86230,86162,Mondion,86,,,86162000ZI0078,,,,,,,,,,,,,0,,,,,T,terres,,,353,0.474141,46.93654
2019-1316395,2019-08-23,000001,Vente,45000,,,LA CASSINE,B016,86230,86162,Mondion,86,,,86162000ZI0080,,,,,,,,,,,,,0,,,,,T,terres,,,730,0.474348,46.936449
2019-1316397,2019-08-26,000002,Vente,50000,,,LE PARC DE MONDION,B045,86230,86162,Mondion,86,,,86162000ZD0106,,,,,,,,,,,,,0,,,,,T,terres,,,1923,0.485107,46.937827
2019-1316397,2019-08-26,000002,Vente,50000,,,LE PARC DE MONDION,B045,86230,86162,Mondion,86,,,86162000ZD0108,,,,,,,,,,,,,0,,,,,BF,futaies feuillues,,,2491,0.48639,46.938774
2019-1316397,2019-08-26,000002,Vente,50000,,,LE PARC DE MONDION,B045,86230,86162,Mondion,86,,,86162000ZD0110,,,,,,,,,,,,,0,,,,,P,prés,,,826,0.485891,46.938594
2019-1316539,2019-09-20,000001,Vente,22845,,,LES GRANDS CHAMPS,B031,86230,86162,Mondion,86,,,86162000ZN0013,,,,,,,,,,,,,0,,,,,T,terres,,,5397,0.449962,46.923144
