id_mutation,date_mutation,numero_disposition,nature_mutation,valeur_fonciere,adresse_numero,adresse_suffixe,adresse_nom_voie,adresse_code_voie,code_postal,code_commune,nom_commune,code_departement,ancien_code_commune,ancien_nom_commune,id_parcelle,ancien_id_parcelle,numero_volume,lot1_numero,lot1_surface_carrez,lot2_numero,lot2_surface_carrez,lot3_numero,lot3_surface_carrez,lot4_numero,lot4_surface_carrez,lot5_numero,lot5_surface_carrez,nombre_lots,code_type_local,type_local,surface_reelle_bati,nombre_pieces_principales,code_nature_culture,nature_culture,code_nature_culture_speciale,nature_culture_speciale,surface_terrain,longitude,latitude
2020-4844,2020-02-25,000001,Vente,25000,,,LA VACHAT SUD,B205,01230,01111,Conand,01,,,011110000A0211,,,,,,,,,,,,,0,,,,,S,sols,,,305,5.460775,45.89747
2020-4844,2020-02-25,000001,Vente,25000,1264,,RTE DE LA CALINE,0018,01230,01111,Conand,01,,,011110000A0212,,,,,,,,,,,,,0,1,Maison,50,2,S,sols,,,651,5.460581,45.89763
2020-4852,2020-03-02,000001,Vente,5500,,,D AVERS LES GRANGES,B003,01230,01111,Conand,01,,,011110000F1627,,,,,,,,,,,,,0,,,,,J,jardins,,,275,5.471595,45.892606
2020-6356,2020-06-19,000001,Vente,79000,,,TREZ LES MAISONS,B202,01230,01111,Conand,01,,,011110000D0383,,,,,,,,,,,,,0,,,,,P,prés,,,3200,5.496468,45.877787
2020-6356,2020-06-19,000001,Vente,79000,,,TREZ LES MAISONS,B202,01230,01111,Conand,01,,,011110000D0384,,,,,,,,,,,,,0,,,,,P,prés,,,531,5.495853,45.877164
2020-6356,2020-06-19,000001,Vente,79000,,,TREZ LES MAISONS,B202,01230,01111,Conand,01,,,011110000D0385,,,,,,,,,,,,,0,,,,,P,prés,,,2720,5.495385,45.877441
2020-6356,2020-06-19,000001,Vente,79000,,,SOUS LE PRE,B194,01230,01111,Conand,01,,,011110000D0386,,,,,,,,,,,,,0,,,,,P,prés,,,408,5.495576,45.877023
2020-6356,2020-06-19,000001,Vente,79000,25,,IMP DE LA DOUA,0028,01230,01111,Conand,01,,,011110000D0417,,,,,,,,,,,,,0,1,Maison,140,3,S,sols,,,428,5.495366,45.876875
2020-6356,2020-06-19,000001,Vente,79000,,,SOUS LE PRE,B194,01230,01111,Conand,01,,,011110000D0418,,,,,,,,,,,,,0,,,,,P,prés,,,993,5.495193,45.877013
2020-8038,2020-09-18,000001,Vente,201450,195,,MTE DU VIEUX CHENE,0071,01230,01111,Conand,01,,,011110000F0406,,,,,,,,,,,,,0,1,Maison,60,3,S,sols,,,992,5.491623,45.877879
2020-8373,2020-09-08,000001,Vente,3000,,,AU CHAMP DE L ETROIT,B025,01230,01111,Conand,01,,,011110000E0116,,,,,,,,,,,,,0,,,,,VI,vignes,,,2098,5.467098,45.902014
2020-8844,2020-09-30,000001,Vente,40000,1289,,RTE DE LA CALINE,0018,01230,01111,Conand,01,,,011110000A0252,,,,,,,,,,,,,0,1,Maison,88,3,P,prés,,,1000,5.460323,45.897333
2020-8844,2020-09-30,000001,Vente,40000,1289,,RTE DE LA CALINE,0018,01230,01111,Conand,01,,,011110000A0252,,,,,,,,,,,,,0,1,Maison,88,3,S,sols,,,610,5.460323,45.897333
2020-9225,2020-10-29,000001,Vente,199000,387,,RTE DE LA CALINE,0018,01230,01111,Conand,01,,,011110000F1610,,,,,,,,,,,,,0,1,Maison,113,4,S,sols,,,1216,5.469248,45.89266
2020-9225,2020-10-29,000001,Vente,199000,387,,RTE DE LA CALINE,0018,01230,01111,Conand,01,,,011110000F1610,,,,,,,,,,,,,0,1,Maison,113,4,P,prés,,,1609,5.469248,45.89266
2020-9378,2020-11-03,000001,Vente,237000,,,AU PERARET,B128,01230,01111,Conand,01,,,011110000F1488,,,,,,,,,,,,,0,,,,,P,prés,,,1500,5.466762,45.888255
2020-9378,2020-11-03,000001,Vente,237000,,,AU PERARET,B128,01230,01111,Conand,01,,,011110000F1489,,,,,,,,,,,,,0,,,,,L,landes,,,452,5.466951,45.888381
2020-9378,2020-11-03,000001,Vente,237000,,,AU PERARET,B128,01230,01111,Conand,01,,,011110000F1490,,,,,,,,,,,,,0,,,,,L,landes,,,223,5.467134,45.888391
2020-9378,2020-11-03,000001,Vente,237000,,,AUX NOIRATTES,B126,01230,01111,Conand,01,,,011110000F1731,,,,,,,,,,,,,0,,,,,P,prés,,,5452,5.46641,45.89196
2020-9378,2020-11-03,000001,Vente,237000,,,AU BIZAY,B006,01230,01111,Conand,01,,,011110000F1741,,,,,,,,,,,,,0,,,,,L,landes,,,2589,5.46757,45.892288
2020-9378,2020-11-03,000001,Vente,237000,,,PRE DE LA PLANCHE,B152,01230,01111,Conand,01,,,011110000F1758,,,,,,,,,,,,,0,,,,,P,prés,,,2910,5.465878,45.892832
2020-9378,2020-11-03,000001,Vente,237000,27,,IMP DE LA FRUITIERE,0034,01230,01111,Conand,01,,,011110000F1796,,,,,,,,,,,,,0,1,Maison,137,3,S,sols,,,677,5.465236,45.892828
2020-9378,2020-11-03,000001,Vente,237000,,,CONAND DU BIEZ CARRE,B059,01230,01111,Conand,01,,,011110000F1797,,,,,,,,,,,,,0,,,,,S,sols,,,32,5.465076,45.8929
2020-9378,2020-11-03,000001,Vente,237000,,,SOUS LA VI,B187,01230,01111,Conand,01,,,011110000F1903,,,,,,,,,,,,,0,,,,,P,prés,,,804,5.465923,45.892596
2020-9441,2020-10-29,000001,Vente,160000,,,CHARIOT,B038,01230,01111,Conand,01,,,011110000F0831,,,,,,,,,,,,,0,,,,,P,prés,,,1608,5.482347,45.876646
2020-9441,2020-10-29,000001,Vente,160000,,,CHARIOT,B038,01230,01111,Conand,01,,,011110000F0833,,,,,,,,,,,,,0,,,,,S,sols,,,378,5.482465,45.877033
2020-9441,2020-10-29,000001,Vente,160000,,,CHARIOT,B038,01230,01111,Conand,01,,,011110000F1873,,,,,,,,,,,,,0,,,,,S,sols,,,89,5.48237,45.877015
2020-9441,2020-10-29,000001,Vente,160000,3980,,MTE DE CHARIOT,0021,01230,01111,Conand,01,,,011110000F1874,,,,,,,,,,,,,0,1,Maison,210,5,S,sols,,,121,5.482291,45.876926
2020-10189,2020-12-16,000001,Vente,189000,2750,,RTE DE LA CHARTREUSE,0022,01230,01111,Conand,01,,,011110000F0453,,,,,,,,,,,,,0,1,Maison,123,6,S,sols,,,1115,5.494091,45.8774
2020-10189,2020-12-16,000001,Vente,189000,,,PRE CHENE,B148,01230,01111,Conand,01,,,011110000F0454,,,,,,,,,,,,,0,,,,,S,sols,,,138,5.493615,45.877499
