id_mutation,date_mutation,numero_disposition,nature_mutation,valeur_fonciere,adresse_numero,adresse_suffixe,adresse_nom_voie,adresse_code_voie,code_postal,code_commune,nom_commune,code_departement,ancien_code_commune,ancien_nom_commune,id_parcelle,ancien_id_parcelle,numero_volume,lot1_numero,lot1_surface_carrez,lot2_numero,lot2_surface_carrez,lot3_numero,lot3_surface_carrez,lot4_numero,lot4_surface_carrez,lot5_numero,lot5_surface_carrez,nombre_lots,code_type_local,type_local,surface_reelle_bati,nombre_pieces_principales,code_nature_culture,nature_culture,code_nature_culture_speciale,nature_culture_speciale,surface_terrain,longitude,latitude
2020-3885,2020-01-03,000001,Vente,72500,190,,GRANDE RUE,0260,01420,01118,Corbonod,01,,,01118000AR0390,,,28,,6,,,,,,,,2,2,Appartement,43,2,,,,,,5.809414,45.970298
2020-4567,2020-02-20,000001,Vente,70000,,,VERS TALEAUD,B266,01420,01118,Corbonod,01,,,01118000AZ0390,,,,,,,,,,,,,0,,,,,AB,terrains a bâtir,,,918,5.816964,45.947458
2020-4567,2020-02-20,000001,Vente,70000,,,VERS TALEAUD,B266,01420,01118,Corbonod,01,,,01118000AZ0391,,,,,,,,,,,,,0,,,,,AB,terrains a bâtir,,,913,5.817123,45.947734
2020-4567,2020-02-20,000001,Vente,70000,,,VERS TALEAUD,B266,01420,01118,Corbonod,01,,,01118000AZ0392,,,,,,,,,,,,,0,,,,,AB,terrains a bâtir,,,979,5.817147,45.947954
2020-4567,2020-02-20,000001,Vente,70000,,,VERS TALEAUD,B266,01420,01118,Corbonod,01,,,01118000AZ0393,,,,,,,,,,,,,0,,,,,S,sols,,,311,5.816952,45.947758
2020-4790,2020-02-27,000001,Vente,113000,190,,GRANDE RUE,0260,01420,01118,Corbonod,01,,,01118000AR0390,,,51,,,,,,,,,,1,3,Dépendance,,0,,,,,,5.809414,45.970298
2020-4790,2020-02-27,000001,Vente,113000,190,,GRANDE RUE,0260,01420,01118,Corbonod,01,,,01118000AR0390,,,27,37.61,5,,,,,,,,2,2,Appartement,39,2,,,,,,5.809414,45.970298
2020-4917,2020-02-27,000001,Vente,130000,,,VERS TALEAUD,B266,01420,01118,Corbonod,01,,,01118000AZ0313,,,,,,,,,,,,,0,,,,,P,prés,,,9,5.81401,45.947692
2020-4917,2020-02-27,000001,Vente,130000,,,VERS TALEAUD,B266,01420,01118,Corbonod,01,,,01118000AZ0359,,,,,,,,,,,,,0,,,,,S,sols,,,84,5.814152,45.948576
2020-4917,2020-02-27,000001,Vente,130000,,,VERS TALEAUD,B266,01420,01118,Corbonod,01,,,01118000AZ0360,,,,,,,,,,,,,0,,,,,T,terres,,,5029,,
2020-5252,2020-03-17,000002,Echange,30,,,AU CRE,B083,01420,01118,Corbonod,01,,,01118000AX0272,,,,,,,,,,,,,0,,,,,T,terres,,,5,5.811546,45.962052
2020-5252,2020-03-17,000002,Echange,30,,,AUX GRANDS PRES,B136,01420,01118,Corbonod,01,,,01118000AX0285,,,,,,,,,,,,,0,,,,,T,terres,,,98,5.811736,45.961579
2020-5252,2020-03-17,000002,Echange,30,,,AUX GRANDS PRES,B136,01420,01118,Corbonod,01,,,01118000AX0290,,,,,,,,,,,,,0,,,,,T,terres,,,108,5.811677,45.961529
2020-5253,2020-03-17,000001,Echange,160,,,AU CRE,B083,01420,01118,Corbonod,01,,,01118000AX0273,,,,,,,,,,,,,0,,,,,T,terres,,,42,5.811554,45.962003
2020-5253,2020-03-17,000002,Echange,160,,,AU CRE,B083,01420,01118,Corbonod,01,,,01118000AX0275,,,,,,,,,,,,,0,,,,,VI,vignes,,,147,5.81144,45.961864
2020-5262,2020-03-20,000001,Vente,77000,190,,GRANDE RUE,0260,01420,01118,Corbonod,01,,,01118000AR0390,,,12,,34,43.46,,,,,,,2,2,Appartement,43,2,,,,,,5.809414,45.970298
2020-5559,2020-04-06,000001,Vente,2218,,,A MANCIN,B181,01420,01118,Corbonod,01,,,01118000AN0154,,,,,,,,,,,,,0,,,,,P,prés,,,4418,5.829652,45.968011
2020-5559,2020-04-06,000001,Vente,2218,,,A MANCIN,B181,01420,01118,Corbonod,01,,,01118000AN0164,,,,,,,,,,,,,0,,,,,P,prés,,,10190,5.829366,45.96688
2020-5559,2020-04-06,000001,Vente,2218,,,A MANCIN,B181,01420,01118,Corbonod,01,,,01118000AN0165,,,,,,,,,,,,,0,,,,,BT,taillis simples,,,7570,5.829213,45.966644
2020-5715,2020-05-04,000001,Vente,332500,110,,CHE DE LA BRUNE,0070,01420,01118,Corbonod,01,,,01118000AO0154,,,,,,,,,,,,,0,1,Maison,130,4,S,sols,,,1000,5.822979,45.967544
2020-6177,2020-06-04,000001,Vente,257100,59,,RUE DU NANT COTTIN,0421,01420,01118,Corbonod,01,,,01118000AO0052,,,,,,,,,,,,,0,1,Maison,90,4,S,sols,,,118,5.820542,45.968807
2020-6177,2020-06-04,000001,Vente,257100,,,CORBONOD,B069,01420,01118,Corbonod,01,,,01118000AO0053,,,,,,,,,,,,,0,,,,,J,jardins,,,535,5.820316,45.968786
2020-6511,2020-06-19,000001,Vente,125000,,,EILLOUX,B104,01420,01118,Corbonod,01,,,01118000AK0001,,,,,,,,,,,,,0,,,,,L,landes,,,75,5.817702,45.976508
2020-6511,2020-06-19,000001,Vente,125000,103,,RUE DES CORTY,0141,01420,01118,Corbonod,01,,,01118000AK0002,,,,,,,,,,,,,0,1,Maison,46,1,S,sols,,,817,5.817692,45.976305
2020-6722,2020-06-25,000001,Vente,206500,5383,,VIGNES MORREX,B271,01420,01118,Corbonod,01,,,01118000AV0058,,,,,,,,,,,,,0,1,Maison,104,5,P,prés,,,4078,5.823641,45.958734
2020-6722,2020-06-25,000001,Vente,206500,5383,,VIGNES MORREX,B271,01420,01118,Corbonod,01,,,01118000AV0058,,,,,,,,,,,,,0,1,Maison,104,5,S,sols,,,399,5.823641,45.958734
2020-7144,2020-07-13,000001,Vente,354300,115,,RUE DU NANT COTTIN,0421,01420,01118,Corbonod,01,,,01118000AO0185,,,,,,,,,,,,,0,1,Maison,111,5,J,jardins,,,341,5.819688,45.968667
2020-7144,2020-07-13,000001,Vente,354300,115,,RUE DU NANT COTTIN,0421,01420,01118,Corbonod,01,,,01118000AO0185,,,,,,,,,,,,,0,1,Maison,111,5,S,sols,,,1000,5.819688,45.968667
2020-7240,2020-07-17,000001,Vente,500,,,AUX GRANGES DE MONTVERNIER,B146,01420,01118,Corbonod,01,,,011180000E0291,,,,,,,,,,,,,0,,,,,L,landes,,,4041,,
2020-7256,2020-07-20,000001,Vente,15500,190,,GRANDE RUE,0260,01420,01118,Corbonod,01,,,01118000AR0390,,,48,,,,,,,,,,1,3,Dépendance,,0,,,,,,5.809414,45.970298
2020-7433,2020-07-31,000001,Vente,80000,,,CLOS BOUZOUT,B054,01420,01118,Corbonod,01,,,01118000AT0263,,,,,,,,,,,,,0,,,,,T,terres,,,1625,5.816846,45.964889
2020-7653,2020-07-30,000001,Vente,80000,,,A LA TRILLE,B253,01420,01118,Corbonod,01,,,01118000AZ0384,,,,,,,,,,,,,0,,,,,AB,terrains a bâtir,,,920,5.817124,45.946952
2020-8167,2020-03-10,000001,Adjudication,156000,35,,RUE DE MONTVERNIER,0400,01420,01118,Corbonod,01,,,011180000E1011,,,,,,,,,,,,,0,1,Maison,136,7,S,sols,,,395,5.810102,45.94811
2020-8167,2020-03-10,000001,Adjudication,156000,,,CHARBONNIERES,B043,01420,01118,Corbonod,01,,,011180000E1013,,,,,,,,,,,,,0,,,,,S,sols,,,350,5.810338,45.948071
2020-8167,2020-03-10,000001,Adjudication,156000,,,CHARBONNIERES,B043,01420,01118,Corbonod,01,,,011180000E1096,,,,,,,,,,,,,0,,,,,VI,vignes,,,604,5.810702,45.947938
2020-8167,2020-03-10,000001,Adjudication,156000,,,CHARBONNIERES,B043,01420,01118,Corbonod,01,,,011180000E1097,,,,,,,,,,,,,0,,,,,L,landes,,,917,5.810649,45.948201
2020-8235,2020-09-11,000001,Vente,169860,,,A MABOEZ EST,B177,01420,01118,Corbonod,01,,,01118000AV0251,,,,,,,,,,,,,0,,,,,T,terres,,,3156,5.81687,45.963316
2020-8235,2020-09-11,000001,Vente,169860,,,A MABOEZ EST,B177,01420,01118,Corbonod,01,,,01118000AV0252,,,,,,,,,,,,,0,,,,,T,terres,,,2506,5.817143,45.963063
2020-8448,2020-09-24,000001,Vente,165000,,,HAMEAU DE GIGNEZ,B152,01420,01118,Corbonod,01,,,01118000AR0113,,,,,,,,,,,,,0,,,,,L,landes,,,140,5.807986,45.9673
2020-8448,2020-09-24,000001,Vente,165000,4,,PL DU LAVOIR,0310,01420,01118,Corbonod,01,,,01118000AR0118,,,,,,,,,,,,,0,1,Maison,154,6,S,sols,,,100,5.808047,45.967751
2020-8448,2020-09-24,000001,Vente,165000,,,HAMEAU DE GIGNEZ,B152,01420,01118,Corbonod,01,,,01118000AR0149,,,,,,,,,,,,,0,,,,,S,sols,,,118,5.807842,45.967678
2020-8705,2020-09-29,000001,Vente,56143,,,EILLOUX,B104,01420,01118,Corbonod,01,,,01118000AK0195,,,,,,,,,,,,,0,,,,,T,terres,,,510,5.819415,45.977132
2020-8705,2020-09-29,000001,Vente,56143,,,EILLOUX,B104,01420,01118,Corbonod,01,,,01118000AK0198,,,,,,,,,,,,,0,,,,,T,terres,,,341,5.819548,45.977341
2020-8706,2020-09-29,000002,Vente,19857,,,EILLOUX,B104,01420,01118,Corbonod,01,,,01118000AK0199,,,,,,,,,,,,,0,,,,,T,terres,,,301,5.81925,45.977219
2020-8839,2020-10-21,000001,Vente,2438,,,EN LONGE RAIE,B175,01420,01118,Corbonod,01,,,01118000AK0070,,,,,,,,,,,,,0,,,,,P,prés,,,67,5.821553,45.977207
2020-8839,2020-10-21,000001,Vente,2438,,,EN LONGE RAIE,B175,01420,01118,Corbonod,01,,,01118000AK0081,,,,,,,,,,,,,0,,,,,P,prés,,,672,5.823025,45.977464
2020-8839,2020-10-21,000001,Vente,2438,,,SOUS LA ROCHE,B237,01420,01118,Corbonod,01,,,01118000AN0018,,,,,,,,,,,,,0,,,,,P,prés,,,2140,5.823667,45.974946
2020-8839,2020-10-21,000001,Vente,2438,,,A LEMBOFFY,B167,01420,01118,Corbonod,01,,,01118000AN0056,,,,,,,,,,,,,0,,,,,P,prés,,,241,5.826203,45.974502
2020-8839,2020-10-21,000001,Vente,2438,,,A LEMBOFFY,B167,01420,01118,Corbonod,01,,,01118000AN0092,,,,,,,,,,,,,0,,,,,BT,taillis simples,,,785,5.828241,45.974486
2020-8839,2020-10-21,000001,Vente,2438,,,EN CHARVERON,B045,01420,01118,Corbonod,01,,,01118000AN0107,,,,,,,,,,,,,0,,,,,P,prés,,,669,5.827471,45.973814
2020-8982,2020-10-23,000001,Vente,62000,,,LES COTTINS,B079,01420,01118,Corbonod,01,,,011180000E0791,,,,,,,,,,,,,0,,,,,L,landes,,,679,5.802582,45.945269
2020-8982,2020-10-23,000001,Vente,62000,,,LES COTTINS,B079,01420,01118,Corbonod,01,,,011180000E0794,,,,,,,,,,,,,0,,,,,L,landes,,,111,5.802537,45.945578
2020-8982,2020-10-23,000001,Vente,62000,,,MONTVERNIER,B191,01420,01118,Corbonod,01,,,011180000E1419,,,,,,,,,,,,,0,,,,,L,landes,,,392,5.804175,45.946404
2020-8982,2020-10-23,000001,Vente,62000,,,MONTVERNIER,B191,01420,01118,Corbonod,01,,,011180000E1420,,,,,,,,,,,,,0,,,,,L,landes,,,270,5.803574,45.946477
2020-8982,2020-10-23,000001,Vente,62000,,,MONTVERNIER,B191,01420,01118,Corbonod,01,,,011180000E1445,,,,,,,,,,,,,0,,,,,L,landes,,,1219,5.803516,45.946042
2020-8982,2020-10-23,000001,Vente,62000,5206,,MONTVERNIER,B191,01420,01118,Corbonod,01,,,011180000E1447,,,,,,,,,,,,,0,1,Maison,60,2,S,sols,,,543,5.80321,45.946009
2020-8982,2020-10-23,000001,Vente,62000,,,MONTVERNIER,B191,01420,01118,Corbonod,01,,,011180000E1450,,,,,,,,,,,,,0,,,,,L,landes,,,540,5.803003,45.945961
2020-8982,2020-10-23,000001,Vente,62000,,,MONTVERNIER,B191,01420,01118,Corbonod,01,,,011180000E1452,,,,,,,,,,,,,0,,,,,L,landes,,,366,5.803144,45.945855
2020-8982,2020-10-23,000001,Vente,62000,,,MONTVERNIER,B191,01420,01118,Corbonod,01,,,011180000E1458,,,,,,,,,,,,,0,,,,,L,landes,,,965,5.802983,45.945243
2020-8982,2020-10-23,000001,Vente,62000,,,MONTVERNIER,B191,01420,01118,Corbonod,01,,,011180000E1459,,,,,,,,,,,,,0,,,,,L,landes,,,250,5.803042,45.945106
2020-8982,2020-10-23,000001,Vente,62000,,,MONTVERNIER,B191,01420,01118,Corbonod,01,,,011180000E1469,,,,,,,,,,,,,0,,,,,L,landes,,,578,5.803343,45.944798
2020-8982,2020-10-23,000001,Vente,62000,,,MONTVERNIER,B191,01420,01118,Corbonod,01,,,011180000E1474,,,,,,,,,,,,,0,,,,,L,landes,,,32,5.802839,45.944807
2020-9240,2020-10-28,000001,Vente,270000,169,,GRANDE ROUTE (ETRANGINAZ),0251,01420,01118,Corbonod,01,,,01118000AE0185,,,,,,,,,,,,,0,1,Maison,95,4,S,sols,,,477,5.80618,45.980809
2020-9240,2020-10-28,000001,Vente,270000,,,ETRANGINAS,B111,01420,01118,Corbonod,01,,,01118000AE0190,,,,,,,,,,,,,0,,,,,J,jardins,,,1229,5.806481,45.980753
2020-9241,2020-10-28,000001,Vente,14,,,REYMOZ,B227,01420,01118,Corbonod,01,,,011180000E1984,,,,,,,,,,,,,0,,,,,L,landes,,,114,5.809072,45.938503
2020-9423,2020-11-04,000001,Vente,211000,,,AUX GRANDS PRES,B136,01420,01118,Corbonod,01,,,01118000AX0242,,,,,,,,,,,,,0,,,,,L,landes,,,13,5.810522,45.960726
2020-9423,2020-11-04,000001,Vente,211000,,,AUX COMBETTES,B068,01420,01118,Corbonod,01,,,01118000AX0245,,,,,,,,,,,,,0,,,,,S,sols,,,60,5.810547,45.9607
2020-9423,2020-11-04,000001,Vente,211000,260,A,RUE DE FORCHY,0192,01420,01118,Corbonod,01,,,011180000E0605,,,,,,,,,,,,,0,1,Maison,100,5,S,sols,,,558,5.810464,45.960561
2020-9423,2020-11-04,000001,Vente,211000,,,FONTAINE,B119,01420,01118,Corbonod,01,,,011180000E2222,,,,,,,,,,,,,0,,,,,S,sols,,,58,5.810536,45.960659
2020-9425,2020-11-04,000002,Vente,84000,5105,,RTE DU BARRAGE,0013,01420,01118,Corbonod,01,,,01118000AN0175,,,,,,,,,,,,,0,2,Appartement,55,2,S,sols,,,660,5.831963,45.967428
2020-9425,2020-11-04,000002,Vente,84000,5105,,RTE DU BARRAGE,0013,01420,01118,Corbonod,01,,,01118000AN0175,,,,,,,,,,,,,0,2,Appartement,47,2,S,sols,,,660,5.831963,45.967428
2020-9425,2020-11-04,000002,Vente,84000,5105,,RTE DU BARRAGE,0013,01420,01118,Corbonod,01,,,01118000AN0175,,,,,,,,,,,,,0,2,Appartement,32,1,S,sols,,,660,5.831963,45.967428
2020-9425,2020-11-04,000002,Vente,84000,,,A MANCIN,B181,01420,01118,Corbonod,01,,,01118000AN0465,,,,,,,,,,,,,0,,,,,J,jardins,,,93,5.831918,45.967306
2020-9676,2020-11-12,000001,Vente,385000,35,,IMP DES GRANDS PRES,0280,01420,01118,Corbonod,01,,,01118000AX0124,,,,,,,,,,,,,0,1,Maison,118,5,S,sols,,,154,5.812023,45.961384
2020-9676,2020-11-12,000001,Vente,385000,,,AUX GRANDS PRES,B136,01420,01118,Corbonod,01,,,01118000AX0171,,,,,,,,,,,,,0,,,,,S,sols,,,172,5.811894,45.961454
2020-9676,2020-11-12,000001,Vente,385000,,,AUX GRANDS PRES,B136,01420,01118,Corbonod,01,,,01118000AX0283,,,,,,,,,,,,,0,,,,,P,prés,,,68,5.812394,45.961384
2020-9676,2020-11-12,000001,Vente,385000,,,AUX GRANDS PRES,B136,01420,01118,Corbonod,01,,,01118000AX0284,,,,,,,,,,,,,0,,,,,P,prés,,,731,5.812049,45.961446
2020-9676,2020-11-12,000001,Vente,385000,,,AUX GRANDS PRES,B136,01420,01118,Corbonod,01,,,01118000AX0285,,,,,,,,,,,,,0,,,,,P,prés,,,98,5.811736,45.961579
2020-9676,2020-11-12,000001,Vente,385000,,,AUX GRANDS PRES,B136,01420,01118,Corbonod,01,,,01118000AX0290,,,,,,,,,,,,,0,,,,,P,prés,,,108,5.811677,45.961529
2020-9676,2020-11-12,000001,Vente,385000,,,AUX GRANDS PRES,B136,01420,01118,Corbonod,01,,,01118000AX0291,,,,,,,,,,,,,0,,,,,P,prés,,,958,5.812029,45.961285
2020-9676,2020-11-12,000001,Vente,385000,,,AUX GRANDS PRES,B136,01420,01118,Corbonod,01,,,01118000AX0294,,,,,,,,,,,,,0,,,,,P,prés,,,35,5.812437,45.961148
2020-9868,2020-11-24,000001,Vente terrain à bâtir,5200,,,A LA COMBACHARD,B059,01420,01118,Corbonod,01,,,011180000F0130,,,,,,,,,,,,,0,,,,,BS,taillis sous futaie,,,1151,5.778199,45.941358
2020-9868,2020-11-24,000001,Vente terrain à bâtir,5200,,,AUX PLATTIERES,B211,01420,01118,Corbonod,01,,,011180000F0315,,,,,,,,,,,,,0,,,,,L,landes,,,242,5.771953,45.939817
2020-9868,2020-11-24,000001,Vente terrain à bâtir,5200,,,AUX PLATTIERES,B211,01420,01118,Corbonod,01,,,011180000F0317,,,,,,,,,,,,,0,,,,,L,landes,,,123,5.77167,45.939842
2020-9868,2020-11-24,000001,Vente terrain à bâtir,5200,,,AUX PLATTIERES,B211,01420,01118,Corbonod,01,,,011180000F0323,,,,,,,,,,,,,0,,,,,L,landes,,,11664,5.770571,45.939692
2020-9868,2020-11-24,000001,Vente terrain à bâtir,5200,,,SUR LIAND,B173,01420,01118,Corbonod,01,,,011180000F0353,,,,,,,,,,,,,0,,,,,L,landes,,,8967,5.766147,45.941658
2020-9868,2020-11-24,000001,Vente terrain à bâtir,5200,,,SUR LIAND,B173,01420,01118,Corbonod,01,,,011180000F0358,,,,,,,,,,,,,0,,,,,L,landes,,,3930,5.766637,45.941999
2020-9868,2020-11-24,000001,Vente terrain à bâtir,5200,,,SUR LIAND,B173,01420,01118,Corbonod,01,,,011180000F0362,,,,,,,,,,,,,0,,,,,L,landes,,,15131,5.766515,45.942366
2020-9953,2020-11-25,000001,Vente,63000,,,VERS TALEAUD,B266,01420,01118,Corbonod,01,,,01118000AZ0419,,,,,,,,,,,,,0,,,,,AB,terrains a bâtir,,,490,5.813572,45.948162
2020-10114,2020-12-04,000001,Vente,13520,,,AU CHAMP CRILIN,B034,01420,01118,Corbonod,01,,,01118000AE0232,,,,,,,,,,,,,0,,,,,T,terres,,,3208,5.806867,45.982705
2020-10114,2020-12-04,000001,Vente,13520,,,AU CHAMP CRILIN,B034,01420,01118,Corbonod,01,,,01118000AE0233,,,,,,,,,,,,,0,,,,,S,sols,,,344,5.806681,45.982539
2020-10156,2020-12-08,000001,Vente,10000,,,AUX TENAILLES,B246,01420,01118,Corbonod,01,,,011180000A0635,,,,,,,,,,,,,0,,,,,L,landes,,,465,5.768031,45.976565
2020-10156,2020-12-08,000001,Vente,10000,,,AUX TENAILLES,B246,01420,01118,Corbonod,01,,,011180000A0639,,,,,,,,,,,,,0,,,,,S,sols,,,397,5.767787,45.976473
2020-10156,2020-12-08,000001,Vente,10000,,,AUX TENAILLES,B246,01420,01118,Corbonod,01,,,011180000A0641,,,,,,,,,,,,,0,,,,,L,landes,,,94,5.767892,45.976542
2020-10156,2020-12-08,000001,Vente,10000,,,AUX TENAILLES,B246,01420,01118,Corbonod,01,,,011180000A0642,,,,,,,,,,,,,0,,,,,L,landes,,,140,5.767664,45.976579
2020-10156,2020-12-08,000001,Vente,10000,,,AUX TENAILLES,B246,01420,01118,Corbonod,01,,,011180000A0643,,,,,,,,,,,,,0,,,,,L,landes,,,421,5.767483,45.97643
2020-10156,2020-12-08,000001,Vente,10000,,,AUX TENAILLES,B246,01420,01118,Corbonod,01,,,011180000A0644,,,,,,,,,,,,,0,,,,,L,landes,,,2837,5.767786,45.976636
2020-10459,2020-12-28,000001,Vente,89000,190,,GRANDE RUE,0260,01420,01118,Corbonod,01,,,01118000AR0390,,,16,,38,37.05,,,,,,,2,2,Appartement,37,2,,,,,,5.809414,45.970298
2020-10540,2020-12-16,000001,Vente,270000,129,,RUE DES GRANDS PRES,0290,01420,01118,Corbonod,01,,,01118000AR0482,,,,,,,,,,,,,0,1,Maison,80,4,S,sols,,,808,5.807769,45.969626
