id_mutation,date_mutation,numero_disposition,nature_mutation,valeur_fonciere,adresse_numero,adresse_suffixe,adresse_nom_voie,adresse_code_voie,code_postal,code_commune,nom_commune,code_departement,ancien_code_commune,ancien_nom_commune,id_parcelle,ancien_id_parcelle,numero_volume,lot1_numero,lot1_surface_carrez,lot2_numero,lot2_surface_carrez,lot3_numero,lot3_surface_carrez,lot4_numero,lot4_surface_carrez,lot5_numero,lot5_surface_carrez,nombre_lots,code_type_local,type_local,surface_reelle_bati,nombre_pieces_principales,code_nature_culture,nature_culture,code_nature_culture_speciale,nature_culture_speciale,surface_terrain,longitude,latitude
2020-4746,2020-02-27,000001,Vente,2656.8,,,CHAMP MILLET,B022,01460,01170,Béard-Géovreissiat,01,,,011700000B0274,,,,,,,,,,,,,0,,,,,P,prés,,,4428,5.547619,46.191003
2020-4965,2020-02-15,000001,Vente,46500,14,,RUE DE L'EGLISE,0036,01460,01170,Béard-Géovreissiat,01,,,01170000AB0402,,,,,,,,,,,,,0,3,Dépendance,,0,S,sols,,,87,5.556989,46.189804
2020-5769,2020-04-29,000001,Vente,175000,582,,RUE DE BEARD,0005,01460,01170,Béard-Géovreissiat,01,,,01170000AC0239,,,,,,,,,,,,,0,1,Maison,84,4,S,sols,,,533,5.545162,46.187275
2020-5769,2020-04-29,000001,Vente,175000,,,BEARD,B005,01460,01170,Béard-Géovreissiat,01,,,01170000AC0241,,,,,,,,,,,,,0,,,,,S,sols,,,20,5.545093,46.187203
2020-6100,2020-06-03,000001,Vente,2460,,,AU VILLAGE,B082,01460,01170,Béard-Géovreissiat,01,,,01170000AB0230,,,,,,,,,,,,,0,,,,,S,sols,,,164,5.557147,46.1895
2020-6354,2020-05-30,000001,Vente,120000,103,,IMP EN CLAY,0019,01460,01170,Béard-Géovreissiat,01,,,01170000AI0118,,,,,,,,,,,,,0,1,Maison,80,4,S,sols,,,1014,5.545598,46.185688
2020-6575,2020-06-04,000001,Vente,137500,,,EN BARBOA,B003,01460,01170,Béard-Géovreissiat,01,,,01170000AI0385,,,,,,,,,,,,,0,,,,,AB,terrains a bâtir,,,630,5.549142,46.186499
2020-6575,2020-06-04,000001,Vente,137500,,,EN BARBOA,B003,01460,01170,Béard-Géovreissiat,01,,,01170000AI0386,,,,,,,,,,,,,0,,,,,AB,terrains a bâtir,,,620,5.548822,46.186544
2020-7942,2020-08-03,000002,Vente,61400,,,SOUS LA VILLE,B068,01460,01170,Béard-Géovreissiat,01,,,01170000AB0404,,,,,,,,,,,,,0,,,,,P,prés,,,407,5.556101,46.190819
2020-7942,2020-08-03,000002,Vente,61400,,,SOUS LA VILLE,B068,01460,01170,Béard-Géovreissiat,01,,,01170000AB0410,,,,,,,,,,,,,0,,,,,P,prés,,,2,5.556535,46.190452
2020-7942,2020-08-03,000002,Vente,61400,,,SOUS LA VILLE,B068,01460,01170,Béard-Géovreissiat,01,,,01170000AB0412,,,,,,,,,,,,,0,,,,,P,prés,,,133,5.556148,46.191205
2020-7942,2020-08-03,000002,Vente,61400,,,SOUS LA VILLE,B068,01460,01170,Béard-Géovreissiat,01,,,01170000AB0414,,,,,,,,,,,,,0,,,,,P,prés,,,1124,5.556022,46.191084
2020-7942,2020-08-03,000002,Vente,61400,33,,RTE DE PIRE,0078,01460,01170,Béard-Géovreissiat,01,,,01170000AB0419,,,,,,,,,,,,,0,1,Maison,79,3,S,sols,,,313,5.556716,46.190356
2020-7942,2020-08-03,000002,Vente,61400,,,SOUS LA VILLE,B068,01460,01170,Béard-Géovreissiat,01,,,01170000AB0422,,,,,,,,,,,,,0,,,,,P,prés,,,973,5.556523,46.190632
2020-8020,2020-08-28,000001,Vente,133000,688,,RUE DE BEARD,0005,01460,01170,Béard-Géovreissiat,01,,,01170000AC0253,,,,,,,,,,,,,0,1,Maison,82,3,S,sols,,,600,5.544255,46.188119
2020-8710,2020-10-20,000002,Vente,8200,,,EN PRE PAVIOT,B060,01460,01170,Béard-Géovreissiat,01,,,011700000B1173,,,,,,,,,,,,,0,,,,,S,sols,,,1076,5.561138,46.177502
2020-9002,2020-10-29,000001,Vente,6500,,,SUR CURTIL,B038,01460,01170,Béard-Géovreissiat,01,,,01170000AI0054,,,,,,,,,,,,,0,,,,,T,terres,,,1217,5.553532,46.187925
2020-9002,2020-10-29,000001,Vente,6500,,,SUR CURTIL,B038,01460,01170,Béard-Géovreissiat,01,,,01170000AI0055,,,,,,,,,,,,,0,,,,,T,terres,,,3904,5.553584,46.187651
2020-9002,2020-10-29,000001,Vente,6500,,,SUR CURTIL,B038,01460,01170,Béard-Géovreissiat,01,,,01170000AI0060,,,,,,,,,,,,,0,,,,,P,prés,,,1751,5.553783,46.186757
2020-9374,2020-10-22,000003,Vente,175000,2,,DOM DE LOGNA,A008,01460,01170,Béard-Géovreissiat,01,,,01170000AI0400,,,,,,,,,,,,,0,,,,,S,sols,,,288,5.546705,46.18563
2020-10349,2020-12-11,000001,Vente,215000,,,AU VILLAGE,B082,01460,01170,Béard-Géovreissiat,01,,,01170000AB0374,,,,,,,,,,,,,0,,,,,S,sols,,,224,5.556508,46.189578
2020-10349,2020-12-11,000001,Vente,215000,,,AU VILLAGE,B082,01460,01170,Béard-Géovreissiat,01,,,01170000AB0377,,,,,,,,,,,,,0,,,,,S,sols,,,44,5.556753,46.189456
2020-10349,2020-12-11,000001,Vente,215000,110,,IMP DES NOISETIERS,0092,01460,01170,Béard-Géovreissiat,01,,,01170000AB0380,,,,,,,,,,,,,0,1,Maison,94,4,S,sols,,,660,5.556582,46.188879
2020-10349,2020-12-11,000001,Vente,215000,,,AU VILLAGE,B082,01460,01170,Béard-Géovreissiat,01,,,01170000AB0381,,,,,,,,,,,,,0,,,,,S,sols,,,475,5.556968,46.189266
2020-10349,2020-12-11,000001,Vente,215000,,,AU VILLAGE,B082,01460,01170,Béard-Géovreissiat,01,,,01170000AB0382,,,,,,,,,,,,,0,,,,,S,sols,,,38,5.556811,46.188999
2020-10544,2020-12-23,000001,Vente,212000,,,SAINT GERMAIN DE BEARD,B062,01460,01170,Béard-Géovreissiat,01,,,01170000AC0267,,,,,,,,,,,,,0,,,,,P,prés,,,100,5.543424,46.193551
2020-10544,2020-12-23,000001,Vente,212000,1130,B,RUE DE BEARD,0005,01460,01170,Béard-Géovreissiat,01,,,01170000AC0296,,,,,,,,,,,,,0,1,Maison,170,4,S,sols,,,1109,5.543531,46.193682
2020-10544,2020-12-23,000001,Vente,212000,,,SAINT GERMAIN DE BEARD,B062,01460,01170,Béard-Géovreissiat,01,,,01170000AC0298,,,,,,,,,,,,,0,,,,,P,prés,,,41,5.543751,46.193782
