id_mutation,date_mutation,numero_disposition,nature_mutation,valeur_fonciere,adresse_numero,adresse_suffixe,adresse_nom_voie,adresse_code_voie,code_postal,code_commune,nom_commune,code_departement,ancien_code_commune,ancien_nom_commune,id_parcelle,ancien_id_parcelle,numero_volume,lot1_numero,lot1_surface_carrez,lot2_numero,lot2_surface_carrez,lot3_numero,lot3_surface_carrez,lot4_numero,lot4_surface_carrez,lot5_numero,lot5_surface_carrez,nombre_lots,code_type_local,type_local,surface_reelle_bati,nombre_pieces_principales,code_nature_culture,nature_culture,code_nature_culture_speciale,nature_culture_speciale,surface_terrain,longitude,latitude
2020-223,2020-01-25,000001,Vente,46416.3,,,LA CHANAZ,B021,01250,01177,Grand-Corent,01,,,011770000C0150,,,,,,,,,,,,,0,,,,,BS,taillis sous futaie,,,5500,5.420114,46.194443
2020-223,2020-01-25,000001,Vente,46416.3,,,LA CHANAZ,B021,01250,01177,Grand-Corent,01,,,011770000C0151,,,,,,,,,,,,,0,,,,,BS,taillis sous futaie,,,1220,5.42022,46.19531
2020-223,2020-01-25,000001,Vente,46416.3,,,LA CHANAZ,B021,01250,01177,Grand-Corent,01,,,011770000C0154,,,,,,,,,,,,,0,,,,,P,prés,,,2020,5.420185,46.195407
2020-223,2020-01-25,000001,Vente,46416.3,,,LA CHANAZ,B021,01250,01177,Grand-Corent,01,,,011770000C0155,,,,,,,,,,,,,0,,,,,P,prés,,,1800,5.420157,46.195674
2020-223,2020-01-25,000001,Vente,46416.3,,,LA CHANAZ,B021,01250,01177,Grand-Corent,01,,,011770000C0156,,,,,,,,,,,,,0,,,,,P,prés,,,1610,5.420124,46.195844
2020-223,2020-01-25,000001,Vente,46416.3,,,LA CHANAZ,B021,01250,01177,Grand-Corent,01,,,011770000C0157,,,,,,,,,,,,,0,,,,,P,prés,,,3702,5.420858,46.196597
2020-223,2020-01-25,000001,Vente,46416.3,,,LA CHANAZ,B021,01250,01177,Grand-Corent,01,,,011770000C0158,,,,,,,,,,,,,0,,,,,P,prés,,,780,5.419593,46.195768
2020-223,2020-01-25,000001,Vente,46416.3,,,LA CHANAZ,B021,01250,01177,Grand-Corent,01,,,011770000C0159,,,,,,,,,,,,,0,,,,,P,prés,,,2205,5.420409,46.196491
2020-223,2020-01-25,000001,Vente,46416.3,,,COMBE LIATAZ,B032,01250,01177,Grand-Corent,01,,,011770000C0199,,,,,,,,,,,,,0,,,,,L,landes,,,2160,5.419164,46.19507
2020-223,2020-01-25,000001,Vente,46416.3,,,COMBE LIATAZ,B032,01250,01177,Grand-Corent,01,,,011770000C0200,,,,,,,,,,,,,0,,,,,L,landes,,,1970,5.41907,46.19457
2020-223,2020-01-25,000001,Vente,46416.3,,,COMBE LIATAZ,B032,01250,01177,Grand-Corent,01,,,011770000C0201,,,,,,,,,,,,,0,,,,,S,sols,,,5,5.419378,46.194626
2020-223,2020-01-25,000001,Vente,46416.3,,,COMBE LIATAZ,B032,01250,01177,Grand-Corent,01,,,011770000C0202,,,,,,,,,,,,,0,,,,,P,prés,,,5192,5.419392,46.194752
2020-223,2020-01-25,000001,Vente,46416.3,,,COMBE LIATAZ,B032,01250,01177,Grand-Corent,01,,,011770000C0203,,,,,,,,,,,,,0,,,,,L,landes,,,270,5.419163,46.193651
2020-223,2020-01-25,000001,Vente,46416.3,,,COMBE LIATAZ,B032,01250,01177,Grand-Corent,01,,,011770000C0204,,,,,,,,,,,,,0,,,,,P,prés,,,3728,5.418401,46.194014
2020-223,2020-01-25,000001,Vente,46416.3,,,COMBE LIATAZ,B032,01250,01177,Grand-Corent,01,,,011770000C0207,,,,,,,,,,,,,0,,,,,P,prés,,,2770,5.417041,46.193606
2020-223,2020-01-25,000001,Vente,46416.3,,,LA CHARMILLE,B025,01250,01177,Grand-Corent,01,,,011770000C0212,,,,,,,,,,,,,0,,,,,P,prés,,,7270,5.418462,46.193045
2020-223,2020-01-25,000001,Vente,46416.3,,,LA CHANAZ,B021,01250,01177,Grand-Corent,01,,,011770000C0650,,,,,,,,,,,,,0,,,,,P,prés,,,198,5.420986,46.196987
2020-223,2020-01-25,000001,Vente,46416.3,,,COMBE LIATAZ,B032,01250,01177,Grand-Corent,01,,,011770000C0651,,,,,,,,,,,,,0,,,,,S,sols,,,7,5.419414,46.19527
2020-223,2020-01-25,000001,Vente,46416.3,,,COMBE LIATAZ,B032,01250,01177,Grand-Corent,01,,,011770000C0652,,,,,,,,,,,,,0,,,,,S,sols,,,99,5.419427,46.195201
2020-960,2020-04-30,000001,Vente,210725,,,SOUS LE RESERVOIR,B091,01250,01177,Grand-Corent,01,,,011770000A0659,,,,,,,,,,,,,0,,,,,J,jardins,,,800,5.435421,46.206804
2020-960,2020-04-30,000001,Vente,210725,,,SOUS LE RESERVOIR,B091,01250,01177,Grand-Corent,01,,,011770000A0659,,,,,,,,,,,,,0,,,,,S,sols,,,567,5.435421,46.206804
2020-960,2020-04-30,000001,Vente,210725,5107,,SOUS LE RESERVOIR,B091,01250,01177,Grand-Corent,01,,,011770000A0660,,,,,,,,,,,,,0,1,Maison,180,6,S,sols,,,1222,5.435551,46.207073
2020-1496,2020-07-02,000001,Vente,190000,5062,,EN BOURRAVIER,B012,01250,01177,Grand-Corent,01,,,011770000B0192,,,,,,,,,,,,,0,1,Maison,114,4,S,sols,,,85,5.428764,46.20075
2020-1496,2020-07-02,000001,Vente,190000,,,EN BOURRAVIER,B012,01250,01177,Grand-Corent,01,,,011770000B0193,,,,,,,,,,,,,0,,,,,P,prés,,,125,5.428566,46.200772
2020-1496,2020-07-02,000001,Vente,190000,,,EN BOURRAVIER,B012,01250,01177,Grand-Corent,01,,,011770000B0196,,,,,,,,,,,,,0,,,,,S,sols,,,170,5.428668,46.200598
2020-1764,2020-07-01,000001,Vente,39000,5044,,LA VILLE,B097,01250,01177,Grand-Corent,01,,,011770000B0090,,,,,,,,,,,,,0,1,Maison,70,3,S,sols,,,90,5.430777,46.199133
2020-1843,2020-07-18,000001,Vente,127500,,,LES CEYZERIAT,B018,01250,01177,Grand-Corent,01,,,011770000A0578,,,,,,,,,,,,,0,,,,,L,landes,,,40,5.4314,46.201858
2020-1843,2020-07-18,000001,Vente,127500,5033,,LES CEYZERIAT,B018,01250,01177,Grand-Corent,01,,,011770000A0720,,,,,,,,,,,,,0,1,Maison,152,5,S,sols,,,361,5.431731,46.201765
2020-1843,2020-07-18,000001,Vente,127500,,,LES CEYZERIAT,B018,01250,01177,Grand-Corent,01,,,011770000A0722,,,,,,,,,,,,,0,,,,,AG,terrains d'agrément,,,505,5.431532,46.201602
