id_mutation,date_mutation,numero_disposition,nature_mutation,valeur_fonciere,adresse_numero,adresse_suffixe,adresse_nom_voie,adresse_code_voie,code_postal,code_commune,nom_commune,code_departement,ancien_code_commune,ancien_nom_commune,id_parcelle,ancien_id_parcelle,numero_volume,lot1_numero,lot1_surface_carrez,lot2_numero,lot2_surface_carrez,lot3_numero,lot3_surface_carrez,lot4_numero,lot4_surface_carrez,lot5_numero,lot5_surface_carrez,nombre_lots,code_type_local,type_local,surface_reelle_bati,nombre_pieces_principales,code_nature_culture,nature_culture,code_nature_culture_speciale,nature_culture_speciale,surface_terrain,longitude,latitude
2020-84,2020-01-17,000001,Vente,9000,,,LES DEVANTS,B038,01250,01321,Revonnas,01,,,01321000ZA0039,,,,,,,,,,,,,0,,,,,P,prés,,,9320,5.31492,46.165817
2020-84,2020-01-17,000001,Vente,9000,,,LES DEVANTS,B038,01250,01321,Revonnas,01,,,01321000ZA0041,,,,,,,,,,,,,0,,,,,P,prés,,,16940,5.314847,46.165255
2020-445,2020-02-13,000001,Vente,180000,,,AUX ROCHATS,B085,01250,01321,Revonnas,01,,,01321000ZH0016,,,,,,,,,,,,,0,,,,,P,prés,,,4720,5.348921,46.159386
2020-445,2020-02-13,000001,Vente,180000,,,AUX ROCHATS,B085,01250,01321,Revonnas,01,,,01321000ZH0017,,,,,,,,,,,,,0,,,,,P,prés,,,5460,5.348289,46.158378
2020-445,2020-02-13,000001,Vente,180000,,,TERRE DE SEILLON,B099,01250,01321,Revonnas,01,,,01321000ZH0018,,,,,,,,,,,,,0,,,,,P,prés,,,2500,,
2020-445,2020-02-13,000001,Vente,180000,,,TERRE DE SEILLON,B099,01250,01321,Revonnas,01,,,01321000ZH0018,,,,,,,,,,,,,0,,,,,P,prés,,,2500,,
2020-445,2020-02-13,000001,Vente,180000,,,TERRE DE SEILLON,B099,01250,01321,Revonnas,01,,,01321000ZH0018,,,,,,,,,,,,,0,,,,,P,prés,,,600,,
2020-445,2020-02-13,000001,Vente,180000,,,TERRE DE SEILLON,B099,01250,01321,Revonnas,01,,,01321000ZH0018,,,,,,,,,,,,,0,,,,,S,sols,,,2500,,
2020-449,2020-02-12,000001,Vente,163000,255,,CHE DES CONDAMINES,0080,01250,01321,Revonnas,01,,,01321000AA0124,,,,,,,,,,,,,0,1,Maison,87,4,S,sols,,,312,5.329746,46.165694
2020-711,2020-03-17,000001,Vente,120000,130,,RUE DE LA TOUR DU DEAUL,1000,01250,01321,Revonnas,01,,,013210000B0843,,,,,,,,,,,,,0,1,Maison,179,6,S,sols,,,229,5.331311,46.162469
2020-730,2020-03-27,000001,Vente,180000,26,,CHE DE LA CHASSIERE,0050,01250,01321,Revonnas,01,,,013210000B1141,,,,,,,,,,,,,0,1,Maison,90,5,S,sols,,,236,5.330195,46.163246
2020-826,2020-04-07,000001,Vente,205000,5296,,SOUS MARCHAND,B093,01250,01321,Revonnas,01,,,01321000ZB0311,,,,,,,,,,,,,0,1,Maison,97,4,S,sols,,,673,5.324633,46.161928
2020-826,2020-04-07,000001,Vente,205000,,,SOUS MARCHAND,B093,01250,01321,Revonnas,01,,,01321000ZB0314,,,,,,,,,,,,,0,,,,,AB,terrains a bâtir,,,1505,5.324203,46.162341
2020-997,2020-05-14,000001,Vente,247600,55,,CHE DE LA CHASSIERE,0050,01250,01321,Revonnas,01,,,013210000B0168,,,,,,,,,,,,,0,1,Maison,250,5,S,sols,,,1004,5.330462,46.163592
2020-997,2020-05-14,000001,Vente,247600,,,AU VILLAGE,B109,01250,01321,Revonnas,01,,,013210000B1274,,,,,,,,,,,,,0,,,,,S,sols,,,43,5.330146,46.163544
2020-1243,2020-06-03,000001,Vente,500,,,A SENISSIAT,B087,01250,01321,Revonnas,01,,,013210000D0161,,,,,,,,,,,,,0,,,,,J,jardins,,,100,5.340802,46.159763
2020-1260,2020-05-29,000001,Vente,257000,222,,SOUS MARCHAND,B093,01250,01321,Revonnas,01,,,01321000ZB0235,,,,,,,,,,,,,0,1,Maison,109,5,S,sols,,,500,5.326051,46.161695
2020-1260,2020-05-29,000001,Vente,257000,222,,SOUS MARCHAND,B093,01250,01321,Revonnas,01,,,01321000ZB0235,,,,,,,,,,,,,0,1,Maison,109,5,AG,terrains d'agrément,,,758,5.326051,46.161695
2020-1297,2020-06-10,000001,Vente,197000,115,,RUE DE LA TOUR DU DEAUL,1000,01250,01321,Revonnas,01,,,013210000B1052,,,,,,,,,,,,,0,1,Maison,98,4,S,sols,,,179,5.331214,46.162725
2020-1571,2020-07-03,000001,Vente,308000,5305,,SOUS MARCHAND,B093,01250,01321,Revonnas,01,,,01321000ZB0309,,,,,,,,,,,,,0,1,Maison,139,5,S,sols,,,1091,5.325309,46.16197
2020-1571,2020-07-03,000001,Vente,308000,,,SOUS MARCHAND,B093,01250,01321,Revonnas,01,,,01321000ZB0314,,,,,,,,,,,,,0,,,,,AB,terrains a bâtir,,,1505,5.324203,46.162341
2020-1660,2020-07-20,000001,Vente,1600,,,BOIS BORCHU,B005,01250,01321,Revonnas,01,,,01321000ZH0095,,,,,,,,,,,,,0,,,,,BT,taillis simples,,,1200,5.341711,46.152289
2020-1660,2020-07-20,000001,Vente,1600,,,SUR LES RIPPES,B084,01250,01321,Revonnas,01,,,01321000ZH0098,,,,,,,,,,,,,0,,,,,P,prés,,,3880,5.339256,46.153074
2020-1660,2020-07-20,000001,Vente,1600,,,SUR LES RIPPES,B084,01250,01321,Revonnas,01,,,01321000ZH0098,,,,,,,,,,,,,0,,,,,P,prés,,,3880,5.339256,46.153074
2020-1718,2020-07-23,000001,Vente,212270,331,,RUE DU REVERMONT,0910,01250,01321,Revonnas,01,,,013210000D0043,,,,,,,,,,,,,0,1,Maison,156,5,S,sols,,,558,5.3437,46.158979
2020-1718,2020-07-23,000001,Vente,212270,,,A SENISSIAT,B087,01250,01321,Revonnas,01,,,013210000D0044,,,,,,,,,,,,,0,,,,,P,prés,,,1083,5.34396,46.158971
2020-1822,2020-07-30,000001,Vente,152000,65,,IMP CLOS CARTIER,0070,01250,01321,Revonnas,01,,,013210000B0863,,,,,,,,,,,,,0,1,Maison,73,3,S,sols,,,924,5.328632,46.162568
2020-2054,2020-08-27,000002,Vente,703,,,TERRE DE SEILLON,B099,01250,01321,Revonnas,01,,,01321000ZH0144,,,,,,,,,,,,,0,,,,,P,prés,,,2343,,
2020-2110,2020-08-27,000001,Vente,252500,,,A LA GRILLETTE,B059,01250,01321,Revonnas,01,,,01321000ZA0273,,,,,,,,,,,,,0,,,,,S,sols,,,325,5.326427,46.164181
2020-2110,2020-08-27,000001,Vente,252500,,,A LA GRILLETTE,B059,01250,01321,Revonnas,01,,,01321000ZA0275,,,,,,,,,,,,,0,,,,,S,sols,,,150,5.326339,46.164413
2020-2110,2020-08-27,000001,Vente,252500,5300,,A LA GRILLETTE,B059,01250,01321,Revonnas,01,,,01321000ZA0377,,,,,,,,,,,,,0,3,Dépendance,,0,S,sols,,,876,5.326414,46.164948
2020-2110,2020-08-27,000001,Vente,252500,5300,,A LA GRILLETTE,B059,01250,01321,Revonnas,01,,,01321000ZA0377,,,,,,,,,,,,,0,1,Maison,106,4,S,sols,,,876,5.326414,46.164948
2020-2110,2020-08-27,000001,Vente,252500,,,A LA GRILLETTE,B059,01250,01321,Revonnas,01,,,01321000ZA0378,,,,,,,,,,,,,0,,,,,S,sols,,,577,5.326204,46.164777
2020-2230,2020-08-25,000001,Vente,222790,75,,CHE DE LA CHASSIERE,0050,01250,01321,Revonnas,01,,,013210000B1138,,,,,,,,,,,,,0,1,Maison,77,3,S,sols,,,451,5.330764,46.16376
2020-2659,2020-09-11,000001,Vente,145000,,,A SENISSIAT,B087,01250,01321,Revonnas,01,,,013210000D0095,,,,,,,,,,,,,0,,,,,S,sols,,,30,5.345481,46.158714
2020-2659,2020-09-11,000001,Vente,145000,,,A SENISSIAT,B087,01250,01321,Revonnas,01,,,013210000D0110,,,,,,,,,,,,,0,,,,,J,jardins,,,330,5.345809,46.15846
2020-2659,2020-09-11,000001,Vente,145000,500,,RUE DU REVERMONT,0910,01250,01321,Revonnas,01,,,013210000D0111,,,,,,,,,,,,,0,1,Maison,80,3,S,sols,,,126,5.345522,46.158593
2020-3207,2020-11-18,000001,Vente,195750,385,,CHE DES CONDAMINES,0080,01250,01321,Revonnas,01,,,01321000AA0119,,,,,,,,,,,,,0,1,Maison,82,4,S,sols,,,1000,5.329192,46.16707
2020-3207,2020-11-18,000001,Vente,195750,385,,CHE DES CONDAMINES,0080,01250,01321,Revonnas,01,,,01321000AA0119,,,,,,,,,,,,,0,1,Maison,82,4,AG,terrains d'agrément,,,1182,5.329192,46.16707
2020-3392,2020-11-30,000002,Vente,710000,,,AU VILLAGE,B109,01250,01321,Revonnas,01,,,013210000B0002,,,,,,,,,,,,,0,,,,,J,jardins,,,1140,,
2020-3392,2020-11-30,000002,Vente,710000,210,,RTE DE TOSSIAT,0002,01250,01321,Revonnas,01,,,013210000B0003,,,,,,,,,,,,,0,1,Maison,180,4,S,sols,,,1445,,
2020-3392,2020-11-30,000002,Vente,710000,210,,RTE DE TOSSIAT,0002,01250,01321,Revonnas,01,,,013210000B0003,,,,,,,,,,,,,0,1,Maison,190,8,S,sols,,,1445,,
2020-3392,2020-11-30,000002,Vente,710000,,,AU VILLAGE,B109,01250,01321,Revonnas,01,,,013210000B1318,,,,,,,,,,,,,0,,,,,P,prés,,,1447,5.32821,46.161486
2020-3392,2020-11-30,000002,Vente,710000,,,AU VILLAGE,B109,01250,01321,Revonnas,01,,,013210000B1319,,,,,,,,,,,,,0,,,,,P,prés,,,1300,5.327935,46.161363
2020-3392,2020-11-30,000002,Vente,710000,,,AU VILLAGE,B109,01250,01321,Revonnas,01,,,013210000B1320,,,,,,,,,,,,,0,,,,,P,prés,,,1392,,
2020-3392,2020-11-30,000002,Vente,710000,,,AU VILLAGE,B109,01250,01321,Revonnas,01,,,013210000B1321,,,,,,,,,,,,,0,,,,,P,prés,,,1258,5.328179,46.160792
2020-3392,2020-11-30,000002,Vente,710000,,,AU VILLAGE,B109,01250,01321,Revonnas,01,,,013210000B1322,,,,,,,,,,,,,0,,,,,P,prés,,,1251,5.327892,46.160604
2020-3392,2020-11-30,000002,Vente,710000,,,AU VILLAGE,B109,01250,01321,Revonnas,01,,,013210000B1323,,,,,,,,,,,,,0,,,,,P,prés,,,1034,,
2020-3392,2020-11-30,000002,Vente,710000,,,AU VILLAGE,B109,01250,01321,Revonnas,01,,,013210000B1324,,,,,,,,,,,,,0,,,,,P,prés,,,285,5.328296,46.160927
2020-3392,2020-11-30,000002,Vente,710000,,,AU VILLAGE,B109,01250,01321,Revonnas,01,,,013210000B1325,,,,,,,,,,,,,0,,,,,P,prés,,,5,5.327715,46.161558
2020-3392,2020-11-30,000002,Vente,710000,,,AU VILLAGE,B109,01250,01321,Revonnas,01,,,013210000B1326,,,,,,,,,,,,,0,,,,,P,prés,,,40,5.327727,46.161376
2020-3392,2020-11-30,000002,Vente,710000,,,AU VILLAGE,B109,01250,01321,Revonnas,01,,,013210000B1327,,,,,,,,,,,,,0,,,,,P,prés,,,14,5.327744,46.16116
