id_mutation,date_mutation,numero_disposition,nature_mutation,valeur_fonciere,adresse_numero,adresse_suffixe,adresse_nom_voie,adresse_code_voie,code_postal,code_commune,nom_commune,code_departement,ancien_code_commune,ancien_nom_commune,id_parcelle,ancien_id_parcelle,numero_volume,lot1_numero,lot1_surface_carrez,lot2_numero,lot2_surface_carrez,lot3_numero,lot3_surface_carrez,lot4_numero,lot4_surface_carrez,lot5_numero,lot5_surface_carrez,nombre_lots,code_type_local,type_local,surface_reelle_bati,nombre_pieces_principales,code_nature_culture,nature_culture,code_nature_culture_speciale,nature_culture_speciale,surface_terrain,longitude,latitude
2020-109,2020-01-10,000001,Vente,7000,,,AU PELOUX,B172,01310,01375,Saint-Martin-le-Châtel,01,,,01375000AD0079,,,,,,,,,,,,,0,,,,,BT,taillis simples,,,991,5.117467,46.305852
2020-109,2020-01-10,000001,Vente,7000,,,AU PELOUX,B172,01310,01375,Saint-Martin-le-Châtel,01,,,01375000AD0083,,,,,,,,,,,,,0,,,,,BT,taillis simples,,,712,5.11817,46.305305
2020-109,2020-01-10,000001,Vente,7000,,,AU PELOUX,B172,01310,01375,Saint-Martin-le-Châtel,01,,,01375000AD0084,,,,,,,,,,,,,0,,,,,BT,taillis simples,,,426,5.118429,46.305387
2020-109,2020-01-10,000001,Vente,7000,,,AU PELOUX,B172,01310,01375,Saint-Martin-le-Châtel,01,,,01375000AD0085,,,,,,,,,,,,,0,,,,,BT,taillis simples,,,426,5.118593,46.305324
2020-109,2020-01-10,000001,Vente,7000,,,AU PELOUX,B172,01310,01375,Saint-Martin-le-Châtel,01,,,01375000AD0086,,,,,,,,,,,,,0,,,,,BS,taillis sous futaie,,,95,5.118661,46.305265
2020-109,2020-01-10,000001,Vente,7000,,,AU PELOUX,B172,01310,01375,Saint-Martin-le-Châtel,01,,,01375000AD0087,,,,,,,,,,,,,0,,,,,BS,taillis sous futaie,,,171,5.118699,46.305243
2020-109,2020-01-10,000001,Vente,7000,,,AU PELOUX,B172,01310,01375,Saint-Martin-le-Châtel,01,,,01375000AD0088,,,,,,,,,,,,,0,,,,,BT,taillis simples,,,104,5.118783,46.305246
2020-109,2020-01-10,000001,Vente,7000,,,A MENEUVRE,B159,01310,01375,Saint-Martin-le-Châtel,01,,,01375000AD0135,,,,,,,,,,,,,0,,,,,T,terres,,,9090,5.121132,46.301741
2020-109,2020-01-10,000001,Vente,7000,,,A MENEUVRE,B159,01310,01375,Saint-Martin-le-Châtel,01,,,01375000AD0136,,,,,,,,,,,,,0,,,,,T,terres,,,5800,5.121537,46.301409
2020-109,2020-01-10,000001,Vente,7000,,,A MENEUVRE,B159,01310,01375,Saint-Martin-le-Châtel,01,,,01375000AD0137,,,,,,,,,,,,,0,,,,,BT,taillis simples,,,1480,5.121927,46.301521
2020-109,2020-01-10,000001,Vente,7000,,,A MENEUVRE,B159,01310,01375,Saint-Martin-le-Châtel,01,,,01375000AD0138,,,,,,,,,,,,,0,,,,,P,prés,,,2460,5.120378,46.300601
2020-109,2020-01-10,000001,Vente,7000,,,A MENEUVRE,B159,01310,01375,Saint-Martin-le-Châtel,01,,,01375000AD0139,,,,,,,,,,,,,0,,,,,P,prés,,,2560,5.119975,46.300158
2020-109,2020-01-10,000001,Vente,7000,,,A MENEUVRE,B159,01310,01375,Saint-Martin-le-Châtel,01,,,01375000AD0140,,,,,,,,,,,,,0,,,,,P,prés,,,2641,5.119919,46.300759
2020-109,2020-01-10,000001,Vente,7000,,,A MENEUVRE,B159,01310,01375,Saint-Martin-le-Châtel,01,,,01375000AD0141,,,,,,,,,,,,,0,,,,,P,prés,,,2717,5.11933,46.300694
2020-109,2020-01-10,000001,Vente,7000,,,A MENEUVRE,B159,01310,01375,Saint-Martin-le-Châtel,01,,,01375000AD0142,,,,,,,,,,,,,0,,,,,T,terres,,,3388,5.119276,46.301181
2020-109,2020-01-10,000001,Vente,7000,,,AU DEGOUTTE,B072,01310,01375,Saint-Martin-le-Châtel,01,,,01375000AD0276,,,,,,,,,,,,,0,,,,,P,prés,,,2749,5.118776,46.300848
2020-109,2020-01-10,000001,Vente,7000,,,AU DEGOUTTE,B072,01310,01375,Saint-Martin-le-Châtel,01,,,01375000AD0278,,,,,,,,,,,,,0,,,,,P,prés,,,51,5.118355,46.300839
2020-109,2020-01-10,000001,Vente,7000,,,RIPPE CORDIER,B221,01310,01375,Saint-Martin-le-Châtel,01,,,01375000AH0095,,,,,,,,,,,,,0,,,,,BS,taillis sous futaie,,,375,5.130163,46.306823
2020-109,2020-01-10,000001,Vente,7000,,,RIPPE CORDIER,B221,01310,01375,Saint-Martin-le-Châtel,01,,,01375000AH0097,,,,,,,,,,,,,0,,,,,BS,taillis sous futaie,,,52,5.130291,46.306649
2020-109,2020-01-10,000001,Vente,7000,,,RIPPE CORDIER,B221,01310,01375,Saint-Martin-le-Châtel,01,,,01375000AH0098,,,,,,,,,,,,,0,,,,,BS,taillis sous futaie,,,463,5.130284,46.306833
2020-109,2020-01-10,000001,Vente,7000,,,RIPPE CORDIER,B221,01310,01375,Saint-Martin-le-Châtel,01,,,01375000AH0099,,,,,,,,,,,,,0,,,,,BS,taillis sous futaie,,,633,5.130427,46.306893
2020-109,2020-01-10,000001,Vente,7000,,,RIPPE CORDIER,B221,01310,01375,Saint-Martin-le-Châtel,01,,,01375000AH0100,,,,,,,,,,,,,0,,,,,BS,taillis sous futaie,,,792,5.130575,46.306813
2020-109,2020-01-10,000001,Vente,7000,,,RIPPE CORDIER,B221,01310,01375,Saint-Martin-le-Châtel,01,,,01375000AH0102,,,,,,,,,,,,,0,,,,,BS,taillis sous futaie,,,802,5.130754,46.306749
2020-145,2020-01-16,000001,Vente,209.14,,,LA MONTANIERE,B165,01310,01375,Saint-Martin-le-Châtel,01,,,01375000AE0321,,,,,,,,,,,,,0,,,,,AB,terrains a bâtir,,,1285,5.119917,46.295242
2020-145,2020-01-16,000001,Vente,209.14,,,LA MONTANIERE,B165,01310,01375,Saint-Martin-le-Châtel,01,,,01375000AE0323,,,,,,,,,,,,,0,,,,,S,sols,,,34,5.120174,46.295178
2020-308,2020-01-24,000001,Vente,40604,,,LIARIAT,B129,01310,01375,Saint-Martin-le-Châtel,01,,,01375000AM0091,,,,,,,,,,,,,0,,,,,P,prés,,,3020,5.131954,46.288623
2020-308,2020-01-24,000001,Vente,40604,,,LIARIAT,B129,01310,01375,Saint-Martin-le-Châtel,01,,,01375000AM0203,,,,,,,,,,,,,0,,,,,S,sols,,,666,5.131953,46.288984
2020-716,2020-03-12,000001,Vente,1012.01,,,LA MONTANIERE,B165,01310,01375,Saint-Martin-le-Châtel,01,,,01375000AE0322,,,,,,,,,,,,,0,,,,,P,prés,,,6400,5.120698,46.295345
2020-716,2020-03-12,000001,Vente,1012.01,,,LA MONTANIERE,B165,01310,01375,Saint-Martin-le-Châtel,01,,,01375000AE0324,,,,,,,,,,,,,0,,,,,S,sols,,,31,5.120339,46.295202
2020-978,2020-04-30,000001,Vente,175000,1045,,RTE DE MALAFRETAZ,0210,01310,01375,Saint-Martin-le-Châtel,01,,,01375000AH0281,,,,,,,,,,,,,0,1,Maison,106,5,S,sols,,,567,5.131978,46.299971
2020-978,2020-04-30,000001,Vente,175000,1045,,RTE DE MALAFRETAZ,0210,01310,01375,Saint-Martin-le-Châtel,01,,,01375000AH0281,,,,,,,,,,,,,0,1,Maison,106,5,AG,terrains d'agrément,JARD,Jardin d'agrément,1200,5.131978,46.299971
2020-1177,2020-05-27,000002,Vente,39000,,,CONFRANCHESSE,B058,01310,01375,Saint-Martin-le-Châtel,01,,,01375000AH0269,,,,,,,,,,,,,0,,,,,S,sols,,,1309,5.13242,46.302503
2020-1177,2020-05-27,000002,Vente,39000,,,CONFRANCHESSE,B058,01310,01375,Saint-Martin-le-Châtel,01,,,01375000AH0290,,,,,,,,,,,,,0,,,,,P,prés,,,898,5.132386,46.30266
2020-1177,2020-05-27,000002,Vente,39000,,,CONFRANCHESSE,B058,01310,01375,Saint-Martin-le-Châtel,01,,,01375000AH0291,,,,,,,,,,,,,0,,,,,J,jardins,,,347,5.13259,46.302865
2020-1550,2020-06-29,000003,Echange,150,,,LA CHAPELLE,B044,01310,01375,Saint-Martin-le-Châtel,01,,,01375000AP0628,,,,,,,,,,,,,0,,,,,S,sols,,,754,5.124362,46.281765
2020-1558,2020-06-22,000001,Vente,210600,37,,ALL DU BIEF,0050,01310,01375,Saint-Martin-le-Châtel,01,,,01375000AP0409,,,,,,,,,,,,,0,3,Dépendance,,0,S,sols,,,1065,5.118671,46.282511
2020-1558,2020-06-22,000001,Vente,210600,37,,ALL DU BIEF,0050,01310,01375,Saint-Martin-le-Châtel,01,,,01375000AP0409,,,,,,,,,,,,,0,1,Maison,107,5,S,sols,,,1065,5.118671,46.282511
2020-2150,2020-09-04,000001,Vente,81000,607,,RTE DE POLLIAT,0260,01310,01375,Saint-Martin-le-Châtel,01,,,01375000AP0156,,,,,,,,,,,,,0,1,Maison,90,3,S,sols,,,860,5.115468,46.275913
2020-2150,2020-09-04,000001,Vente,81000,,,GROBOZ,B118,01310,01375,Saint-Martin-le-Châtel,01,,,01375000AP0159,,,,,,,,,,,,,0,,,,,P,prés,,,5198,5.116836,46.275812
2020-2615,2020-10-12,000001,Vente,157,,,A CORVANGEL,B063,01310,01375,Saint-Martin-le-Châtel,01,,,01375000AC0046,,,,,,,,,,,,,0,,,,,BT,taillis simples,,,1562,5.100636,46.297279
2020-2786,2020-10-02,000001,Vente,299000,,,CHARLUAT,B045,01310,01375,Saint-Martin-le-Châtel,01,,,01375000AN0148,,,,,,,,,,,,,0,,,,,P,prés,,,8970,5.134905,46.283286
2020-2786,2020-10-02,000001,Vente,299000,580,,RTE D'ATTIGNAT,0010,01310,01375,Saint-Martin-le-Châtel,01,,,01375000AN0149,,,,,,,,,,,,,0,1,Maison,145,4,S,sols,,,2505,5.135738,46.283324
2020-2786,2020-10-02,000001,Vente,299000,,,LA GERINE,B100,01310,01375,Saint-Martin-le-Châtel,01,,,01375000AN0314,,,,,,,,,,,,,0,,,,,T,terres,,,1612,5.135249,46.282329
2020-2786,2020-10-02,000001,Vente,299000,,,LA GERINE,B100,01310,01375,Saint-Martin-le-Châtel,01,,,01375000AN0316,,,,,,,,,,,,,0,,,,,T,terres,,,1539,5.134942,46.28257
2020-2786,2020-10-02,000001,Vente,299000,,,LA GERINE,B100,01310,01375,Saint-Martin-le-Châtel,01,,,01375000AN0318,,,,,,,,,,,,,0,,,,,T,terres,,,2879,5.134036,46.282927
2020-3015,2020-11-04,000002,Vente,68000,,,LA PLANTA,B194,01310,01375,Saint-Martin-le-Châtel,01,,,01375000AP0648,,,,,,,,,,,,,0,,,,,P,prés,,,466,5.116667,46.279365
2020-3015,2020-11-04,000002,Vente,68000,,,LA PLANTA,B194,01310,01375,Saint-Martin-le-Châtel,01,,,01375000AP0651,,,,,,,,,,,,,0,,,,,S,sols,,,737,5.116368,46.279413
2020-3015,2020-11-04,000002,Vente,68000,,,LA PLANTA,B194,01310,01375,Saint-Martin-le-Châtel,01,,,01375000AP0653,,,,,,,,,,,,,0,,,,,S,sols,,,167,5.115947,46.279512
2020-3127,2020-11-18,000001,Vente,206890,134,,RTE DU BLETONNET,0055,01310,01375,Saint-Martin-le-Châtel,01,,,01375000AM0148,,,,,,,,,,,,,0,1,Maison,138,4,P,prés,,,887,5.131051,46.289604
2020-3127,2020-11-18,000001,Vente,206890,134,,RTE DU BLETONNET,0055,01310,01375,Saint-Martin-le-Châtel,01,,,01375000AM0148,,,,,,,,,,,,,0,3,Dépendance,,0,S,sols,,,1098,5.131051,46.289604
2020-3127,2020-11-18,000001,Vente,206890,134,,RTE DU BLETONNET,0055,01310,01375,Saint-Martin-le-Châtel,01,,,01375000AM0148,,,,,,,,,,,,,0,1,Maison,138,4,S,sols,,,1098,5.131051,46.289604
2020-3127,2020-11-18,000001,Vente,206890,134,,RTE DU BLETONNET,0055,01310,01375,Saint-Martin-le-Châtel,01,,,01375000AM0148,,,,,,,,,,,,,0,3,Dépendance,,0,P,prés,,,887,5.131051,46.289604
2020-3244,2020-11-10,000002,Vente,7895,,,BOIS D ARCHE,B014,01310,01375,Saint-Martin-le-Châtel,01,,,01375000AI0109,,,,,,,,,,,,,0,,,,,T,terres,,,3660,5.145848,46.300652
2020-3244,2020-11-10,000002,Vente,7895,,,BOIS D ARCHE,B014,01310,01375,Saint-Martin-le-Châtel,01,,,01375000AI0110,,,,,,,,,,,,,0,,,,,T,terres,,,2410,5.146424,46.300227
2020-3313,2020-12-02,000001,Vente,230000,507,,RTE DE POLLIAT,0260,01310,01375,Saint-Martin-le-Châtel,01,,,01375000AP0327,,,,,,,,,,,,,0,1,Maison,103,4,S,sols,,,625,5.115458,46.276773
2020-3313,2020-12-02,000001,Vente,230000,,,GROBOZ,B118,01310,01375,Saint-Martin-le-Châtel,01,,,01375000AP0593,,,,,,,,,,,,,0,,,,,P,prés,,,2130,5.115303,46.276328
2020-3313,2020-12-02,000001,Vente,230000,,,GROBOZ,B118,01310,01375,Saint-Martin-le-Châtel,01,,,01375000AP0595,,,,,,,,,,,,,0,,,,,S,sols,,,137,5.115465,46.276623
2020-3329,2020-11-30,000001,Vente,64000,,,LA PLANTA,B194,01310,01375,Saint-Martin-le-Châtel,01,,,01375000AP0645,,,,,,,,,,,,,0,,,,,T,terres,,,12,,
2020-3329,2020-11-30,000001,Vente,64000,,,LA PLANTA,B194,01310,01375,Saint-Martin-le-Châtel,01,,,01375000AP0646,,,,,,,,,,,,,0,,,,,T,terres,,,31,5.11594,46.27902
2020-3329,2020-11-30,000001,Vente,64000,,,LA PLANTA,B194,01310,01375,Saint-Martin-le-Châtel,01,,,01375000AP0647,,,,,,,,,,,,,0,,,,,P,prés,,,344,,
2020-3329,2020-11-30,000001,Vente,64000,,,LA PLANTA,B194,01310,01375,Saint-Martin-le-Châtel,01,,,01375000AP0650,,,,,,,,,,,,,0,,,,,S,sols,,,744,,
2020-3329,2020-11-30,000001,Vente,64000,,,LA PLANTA,B194,01310,01375,Saint-Martin-le-Châtel,01,,,01375000AP0652,,,,,,,,,,,,,0,,,,,S,sols,,,112,5.115972,46.279052
