id_mutation,date_mutation,numero_disposition,nature_mutation,valeur_fonciere,adresse_numero,adresse_suffixe,adresse_nom_voie,adresse_code_voie,code_postal,code_commune,nom_commune,code_departement,ancien_code_commune,ancien_nom_commune,id_parcelle,ancien_id_parcelle,numero_volume,lot1_numero,lot1_surface_carrez,lot2_numero,lot2_surface_carrez,lot3_numero,lot3_surface_carrez,lot4_numero,lot4_surface_carrez,lot5_numero,lot5_surface_carrez,nombre_lots,code_type_local,type_local,surface_reelle_bati,nombre_pieces_principales,code_nature_culture,nature_culture,code_nature_culture_speciale,nature_culture_speciale,surface_terrain,longitude,latitude
2020-4502,2020-01-31,000001,Vente,182300,1,,RUE DE LA BOUCHERE,0009,01150,01411,Souclin,01,,,014110000B0964,,,,,,,,,,,,,0,1,Maison,132,5,S,sols,,,130,5.415909,45.876213
2020-4502,2020-01-31,000001,Vente,182300,,,LE VILLAGE,B184,01150,01411,Souclin,01,,,014110000B1788,,,,,,,,,,,,,0,,,,,P,prés,,,66,5.415765,45.876219
2020-5034,2020-03-11,000001,Vente,38000,5053,,LE VILLAGE,B184,01150,01411,Souclin,01,,,014110000B0958,,,,,,,,,,,,,0,1,Maison,64,2,S,sols,,,97,5.415975,45.87574
2020-5034,2020-03-11,000001,Vente,38000,,,LE VILLAGE,B184,01150,01411,Souclin,01,,,014110000B1717,,,,,,,,,,,,,0,,,,,J,jardins,,,268,5.416337,45.875342
2020-5318,2020-03-06,000001,Vente,1600,,,SOUS LE VERGER,B163,01150,01411,Souclin,01,,,014110000B1170,,,,,,,,,,,,,0,,,,,P,prés,,,607,5.420242,45.874662
2020-5318,2020-03-06,000001,Vente,1600,,,PRE MARTIN,B134,01150,01411,Souclin,01,,,014110000B1171,,,,,,,,,,,,,0,,,,,P,prés,,,4670,5.419734,45.874831
2020-5319,2020-02-28,000001,Vente,420,,,TERRE JANNET,B173,01150,01411,Souclin,01,,,014110000A1046,,,,,,,,,,,,,0,,,,,BT,taillis simples,,,2505,5.409667,45.885058
2020-6296,2020-06-09,000002,Vente,200,,,TERRE DE LA BUISSIERE,B171,01150,01411,Souclin,01,,,014110000B1829,,,,,,,,,,,,,0,,,,,P,prés,,,25,5.410511,45.876553
2020-6543,2020-06-05,000001,Vente,250,,,CHAMPIOUT,B031,01150,01411,Souclin,01,,,014110000D0056,,,,,,,,,,,,,0,,,,,T,terres,,,1522,5.424002,45.872709
2020-7693,2020-06-15,000002,Vente,100,,,SOUS LE VERGER,B163,01150,01411,Souclin,01,,,014110000B1827,,,,,,,,,,,,,0,,,,,P,prés,,,7,5.420806,45.875775
2020-8678,2020-09-28,000001,Vente,10250,,,LE VILLAGE,B184,01150,01411,Souclin,01,,,014110000B0934,,,,,,,,,,,,,0,,,,,S,sols,,,40,5.416969,45.875949
2020-8678,2020-09-28,000001,Vente,10250,,,LE VILLAGE,B184,01150,01411,Souclin,01,,,014110000B1026,,,,,,,,,,,,,0,,,,,S,sols,,,89,5.417024,45.876169
2020-8678,2020-09-28,000001,Vente,10250,,,LE VILLAGE,B184,01150,01411,Souclin,01,,,014110000B1027,,,,,,,,,,,,,0,,,,,S,sols,,,88,5.417032,45.876129
2020-9094,2020-10-23,000001,Vente,50,,,SOUS LE VERGER,B163,01150,01411,Souclin,01,,,014110000B1111,,,,,,,,,,,,,0,,,,,P,prés,,,228,5.4176,45.875798
2020-9493,2020-11-18,000001,Vente,10000,,,LE VILLAGE,B184,01150,01411,Souclin,01,,,014110000B1023,,,,,,,,,,,,,0,,,,,S,sols,,,42,5.416884,45.876373
2020-9746,2020-11-21,000001,Vente,71000,5096,,SOUDON,B153,01150,01411,Souclin,01,,,014110000C0141,,,,,,,,,,,,,0,1,Maison,79,3,S,sols,,,67,5.426762,45.867602
2020-9746,2020-11-21,000001,Vente,71000,,,SOUDON,B153,01150,01411,Souclin,01,,,014110000C2190,,,,,,,,,,,,,0,,,,,S,sols,,,8,5.426664,45.8676
2020-9746,2020-11-21,000001,Vente,71000,,,SOUDON,B153,01150,01411,Souclin,01,,,014110000C2192,,,,,,,,,,,,,0,,,,,S,sols,,,2,5.426659,45.867573
2020-10662,2020-12-18,000001,Vente,11.4,,,SOUS LE VERGER,B163,01150,01411,Souclin,01,,,014110000B1161,,,,,,,,,,,,,0,,,,,P,prés,,,38,5.419476,45.875131
