id_mutation,date_mutation,numero_disposition,nature_mutation,valeur_fonciere,adresse_numero,adresse_suffixe,adresse_nom_voie,adresse_code_voie,code_postal,code_commune,nom_commune,code_departement,ancien_code_commune,ancien_nom_commune,id_parcelle,ancien_id_parcelle,numero_volume,lot1_numero,lot1_surface_carrez,lot2_numero,lot2_surface_carrez,lot3_numero,lot3_surface_carrez,lot4_numero,lot4_surface_carrez,lot5_numero,lot5_surface_carrez,nombre_lots,code_type_local,type_local,surface_reelle_bati,nombre_pieces_principales,code_nature_culture,nature_culture,code_nature_culture_speciale,nature_culture_speciale,surface_terrain,longitude,latitude
2020-15037,2020-01-13,000001,Vente,40000,2,,IMP DES PRIMEVERES,0088,02320,02111,Brancourt-en-Laonnois,02,,,021110000C0183,,,,,,,,,,,,,0,1,Maison,46,2,S,sols,,,153,3.417888,49.517485
2020-15037,2020-01-13,000001,Vente,40000,,,LE VILLAGE,B075,02320,02111,Brancourt-en-Laonnois,02,,,021110000C1383,,,,,,,,,,,,,0,,,,,S,sols,,,483,3.417919,49.517554
2020-15159,2020-02-01,000001,Vente,106000,9001,F,IMP DE LA MONTINETTE,0080,02320,02111,Brancourt-en-Laonnois,02,,,021110000C1403,,,,,,,,,,,,,0,1,Maison,66,3,S,sols,,,1091,3.417523,49.519374
2020-15233,2020-02-13,000001,Vente,1878,,,LE GRAND MARAIS,B040,02320,02111,Brancourt-en-Laonnois,02,,,021110000C0416,,,,,,,,,,,,,0,,,,,BP,peupleraies,,,550,3.424011,49.513287
2020-15233,2020-02-13,000001,Vente,1878,,,LA BASSE POUILLEE,B004,02320,02111,Brancourt-en-Laonnois,02,,,021110000C0449,,,,,,,,,,,,,0,,,,,BT,taillis simples,,,1025,3.419868,49.517664
2020-15233,2020-02-13,000001,Vente,1878,,,LA TERREE,B065,02320,02111,Brancourt-en-Laonnois,02,,,021110000C0864,,,,,,,,,,,,,0,,,,,BT,taillis simples,,,531,3.421981,49.51875
2020-15233,2020-02-13,000001,Vente,1878,,,LA TERREE,B065,02320,02111,Brancourt-en-Laonnois,02,,,021110000C0865,,,,,,,,,,,,,0,,,,,BT,taillis simples,,,482,3.422104,49.518849
2020-15233,2020-02-13,000001,Vente,1878,,,LA TERREE,B065,02320,02111,Brancourt-en-Laonnois,02,,,021110000C0866,,,,,,,,,,,,,0,,,,,BT,taillis simples,,,448,3.422192,49.518956
2020-15233,2020-02-13,000001,Vente,1878,,,AU DESSUS DE SAQUET,B031,02320,02111,Brancourt-en-Laonnois,02,,,02111000ZC0001,,,,,,,,,,,,,0,,,,,BT,taillis simples,,,720,3.422046,49.518663
2020-15316,2020-02-18,000001,Vente,11806,,,LE PETIT MARAIS,B050,02320,02111,Brancourt-en-Laonnois,02,,,021110000C0440,,,,,,,,,,,,,0,,,,,BT,taillis simples,,,3612,3.422639,49.515864
2020-15316,2020-02-18,000001,Vente,11806,,,LE MARAIS SOUS LE VILLAGE,B044,02320,02111,Brancourt-en-Laonnois,02,,,021110000C1169,,,,,,,,,,,,,0,,,,,AG,terrains d'agrément,,,3234,3.421593,49.51558
2020-15316,2020-02-18,000001,Vente,11806,,,LE MARAIS SOUS LE VILLAGE,B044,02320,02111,Brancourt-en-Laonnois,02,,,021110000C1170,,,,,,,,,,,,,0,,,,,L,landes,,,569,3.421756,49.515295
2020-15508,2020-03-05,000001,Vente,64500,22,,RUE DE LA CROIX BLANCHE,0047,02320,02111,Brancourt-en-Laonnois,02,,,021110000C0009,,,,,,,,,,,,,0,1,Maison,67,3,S,sols,,,598,3.416509,49.512514
2020-15514,2020-03-10,000001,Vente,19200,,,LE GROS SUYS,B042,02320,02111,Brancourt-en-Laonnois,02,,,02111000ZA0197,,,,,,,,,,,,,0,,,,,S,sols,,,426,3.415703,49.512837
2020-15514,2020-03-10,000001,Vente,19200,,,LE GROS SUYS,B042,02320,02111,Brancourt-en-Laonnois,02,,,02111000ZA0198,,,,,,,,,,,,,0,,,,,S,sols,,,545,3.416032,49.512492
2020-15652,2020-03-17,000001,Vente,5000,,,LA BASSE POUILLEE,B004,02320,02111,Brancourt-en-Laonnois,02,,,021110000C0464,,,,,,,,,,,,,0,,,,,BP,peupleraies,,,1210,3.417605,49.518539
2020-15652,2020-03-17,000001,Vente,5000,,,LA BASSE POUILLEE,B004,02320,02111,Brancourt-en-Laonnois,02,,,021110000C0465,,,,,,,,,,,,,0,,,,,BP,peupleraies,,,1170,3.417468,49.518767
2020-15652,2020-03-17,000001,Vente,5000,,,LA BASSE POUILLEE,B004,02320,02111,Brancourt-en-Laonnois,02,,,021110000C0466,,,,,,,,,,,,,0,,,,,BP,peupleraies,,,476,3.417245,49.518672
2020-15756,2020-04-24,000001,Vente,1085.4,,,LA TERREE,B065,02320,02111,Brancourt-en-Laonnois,02,,,021110000C0896,,,,,,,,,,,,,0,,,,,BT,taillis simples,,,1809,3.423762,49.518367
2020-15814,2020-05-06,000001,Echange,7356.5,,,LE CLOS PENON,B023,02320,02111,Brancourt-en-Laonnois,02,,,021110000C0903,,,,,,,,,,,,,0,,,,,BT,taillis simples,,,4223,3.425589,49.519783
2020-15814,2020-05-06,000001,Echange,7356.5,,,LE CLOS PENON,B023,02320,02111,Brancourt-en-Laonnois,02,,,021110000C0904,,,,,,,,,,,,,0,,,,,BT,taillis simples,,,5270,3.427297,49.519345
2020-15814,2020-05-06,000001,Echange,7356.5,,,LE CLOS PENON,B023,02320,02111,Brancourt-en-Laonnois,02,,,021110000C0905,,,,,,,,,,,,,0,,,,,L,landes,,,5220,3.427031,49.51972
2020-15815,2020-05-06,000002,Echange,7790,,,LA GARENNE,B038,02320,02111,Brancourt-en-Laonnois,02,,,021110000B0235,,,,,,,,,,,,,0,,,,,BT,taillis simples,,,1430,3.408563,49.519842
2020-15815,2020-05-06,000002,Echange,7790,,,LA GARENNE,B038,02320,02111,Brancourt-en-Laonnois,02,,,021110000B0236,,,,,,,,,,,,,0,,,,,BT,taillis simples,,,2020,3.408815,49.519901
2020-15815,2020-05-06,000002,Echange,7790,,,LA GARENNE,B038,02320,02111,Brancourt-en-Laonnois,02,,,021110000B0237,,,,,,,,,,,,,0,,,,,BT,taillis simples,,,1460,3.409047,49.520079
2020-15815,2020-05-06,000002,Echange,7790,,,LA GARENNE,B038,02320,02111,Brancourt-en-Laonnois,02,,,021110000B0238,,,,,,,,,,,,,0,,,,,BT,taillis simples,,,3020,3.410147,49.5201
2020-15815,2020-05-06,000002,Echange,7790,,,LA GARENNE,B038,02320,02111,Brancourt-en-Laonnois,02,,,021110000B0239,,,,,,,,,,,,,0,,,,,BT,taillis simples,,,1530,3.410345,49.52035
2020-15815,2020-05-06,000002,Echange,7790,,,LA GARENNE,B038,02320,02111,Brancourt-en-Laonnois,02,,,021110000B0240,,,,,,,,,,,,,0,,,,,BT,taillis simples,,,1290,3.409412,49.520156
2020-15815,2020-05-06,000002,Echange,7790,,,LE FOND SAINT MAURICE,B033,02320,02111,Brancourt-en-Laonnois,02,,,021110000B0296,,,,,,,,,,,,,0,,,,,BT,taillis simples,,,2350,3.407493,49.518823
2020-15815,2020-05-06,000002,Echange,7790,,,LE FOND SAINT MAURICE,B033,02320,02111,Brancourt-en-Laonnois,02,,,021110000B0298,,,,,,,,,,,,,0,,,,,BT,taillis simples,,,2480,3.406939,49.518431
2020-15816,2020-05-06,000003,Echange,3110,,,LE CLOS PENON,B023,02320,02111,Brancourt-en-Laonnois,02,,,021110000C0912,,,,,,,,,,,,,0,,,,,BT,taillis simples,,,6220,3.429018,49.519077
2020-15876,2020-05-15,000001,Vente,123000,13,,RUE DE LA CROIX BLANCHE,0047,02320,02111,Brancourt-en-Laonnois,02,,,021110000C0323,,,,,,,,,,,,,0,1,Maison,77,5,S,sols,,,732,3.418479,49.513022
2020-15876,2020-05-15,000001,Vente,123000,,,LA CROIX BLANCHE,B027,02320,02111,Brancourt-en-Laonnois,02,,,021110000C1343,,,,,,,,,,,,,0,,,,,J,jardins,,,51,3.418584,49.51309
2020-15925,2020-05-22,000001,Vente,1250,,,AU DESSUS DE SAQUET,B031,02320,02111,Brancourt-en-Laonnois,02,,,02111000ZC0003,,,,,,,,,,,,,0,,,,,VE,vergers,,,4792,3.422075,49.517644
2020-15925,2020-05-22,000001,Vente,1250,,,AU DESSUS DE SAQUET,B031,02320,02111,Brancourt-en-Laonnois,02,,,02111000ZC0003,,,,,,,,,,,,,0,,,,,BP,peupleraies,,,708,3.422075,49.517644
2020-16028,2020-06-16,000001,Vente,20500,,,LA BASSE POUILLEE,B004,02320,02111,Brancourt-en-Laonnois,02,,,021110000C0452,,,,,,,,,,,,,0,,,,,BT,taillis simples,,,1961,3.419388,49.517934
2020-16028,2020-06-16,000001,Vente,20500,,,LA BASSE POUILLEE,B004,02320,02111,Brancourt-en-Laonnois,02,,,021110000C0453,,,,,,,,,,,,,0,,,,,AG,terrains d'agrément,,,722,3.419152,49.518038
2020-16028,2020-06-16,000001,Vente,20500,,,LA BASSE POUILLEE,B004,02320,02111,Brancourt-en-Laonnois,02,,,021110000C0454,,,,,,,,,,,,,0,,,,,AG,terrains d'agrément,,,558,3.418924,49.517961
2020-16028,2020-06-16,000001,Vente,20500,,,LA BASSE POUILLEE,B004,02320,02111,Brancourt-en-Laonnois,02,,,021110000C0455,,,,,,,,,,,,,0,,,,,AG,terrains d'agrément,,,712,3.41932,49.518395
2020-16028,2020-06-16,000001,Vente,20500,,,LA BASSE POUILLEE,B004,02320,02111,Brancourt-en-Laonnois,02,,,021110000C0456,,,,,,,,,,,,,0,,,,,AG,terrains d'agrément,,,687,3.418817,49.517984
2020-16028,2020-06-16,000001,Vente,20500,,,LA BASSE POUILLEE,B004,02320,02111,Brancourt-en-Laonnois,02,,,021110000C0457,,,,,,,,,,,,,0,,,,,BT,taillis simples,,,444,3.418743,49.518035
2020-16075,2020-06-13,000001,Vente,142000,34,,RUE LE CHAMP MAROT,0032,02320,02111,Brancourt-en-Laonnois,02,,,02111000ZA0202,,,,,,,,,,,,,0,1,Maison,69,4,S,sols,,,1000,3.413535,49.515944
2020-16209,2020-06-16,000001,Vente,25000,,,LE GROS SUYS,B042,02320,02111,Brancourt-en-Laonnois,02,,,021110000C1415,,,,,,,,,,,,,0,,,,,S,sols,,,35,3.416439,49.512236
2020-16209,2020-06-16,000001,Vente,25000,,,LE GROS SUYS,B042,02320,02111,Brancourt-en-Laonnois,02,,,021110000C1435,,,,,,,,,,,,,0,,,,,S,sols,,,134,3.416445,49.512348
2020-16209,2020-06-16,000001,Vente,25000,,,LE GROS SUYS,B042,02320,02111,Brancourt-en-Laonnois,02,,,02111000ZA0089,,,,,,,,,,,,,0,,,,,J,jardins,,,870,3.416129,49.512322
2020-16398,2020-07-21,000002,Echange,6000,,,LE BOIS DE BASSE,B005,02320,02111,Brancourt-en-Laonnois,02,,,021110000A0044,,,,,,,,,,,,,0,,,,,BT,taillis simples,,,29727,3.397317,49.509641
2020-16398,2020-07-21,000003,Echange,6000,,,LA PREE,B054,02320,02111,Brancourt-en-Laonnois,02,,,021110000A0773,,,,,,,,,,,,,0,,,,,BP,peupleraies,,,9901,3.405454,49.508844
2020-16436,2020-07-03,000001,Vente,3498,,,LES VIGNES DE BASSE,B073,02320,02111,Brancourt-en-Laonnois,02,,,021110000B0093,,,,,,,,,,,,,0,,,,,BT,taillis simples,,,3410,3.407098,49.515059
2020-16436,2020-07-03,000001,Vente,3498,,,LES VIGNES DE BASSE,B073,02320,02111,Brancourt-en-Laonnois,02,,,021110000B0391,,,,,,,,,,,,,0,,,,,BT,taillis simples,,,343,3.406179,49.514892
2020-16436,2020-07-03,000001,Vente,3498,,,LA PIERRE SOURDE,B051,02320,02111,Brancourt-en-Laonnois,02,,,021110000C0795,,,,,,,,,,,,,0,,,,,BT,taillis simples,,,1859,3.424278,49.522423
2020-16436,2020-07-03,000001,Vente,3498,,,LA PIERRE SOURDE,B051,02320,02111,Brancourt-en-Laonnois,02,,,021110000C0819,,,,,,,,,,,,,0,,,,,BT,taillis simples,,,218,3.423795,49.52282
2020-16499,2020-06-30,000001,Vente,114400,,,LA RUELLE D AUMONT,B058,02320,02111,Brancourt-en-Laonnois,02,,,021110000C0036,,,,,,,,,,,,,0,,,,,J,jardins,,,900,3.417308,49.513888
2020-16499,2020-06-30,000001,Vente,114400,4,,RUE CHANTECLER,0034,02320,02111,Brancourt-en-Laonnois,02,,,021110000C0037,,,,,,,,,,,,,0,1,Maison,108,5,S,sols,,,828,3.417563,49.513905
2020-16805,2020-09-04,000001,Vente,28000,,,LE CHAMP BIGNARD,B014,02320,02111,Brancourt-en-Laonnois,02,,,02111000ZA0268,,,,,,,,,,,,,0,,,,,AB,terrains a bâtir,,,1293,3.41282,49.518691
2020-16989,2020-09-17,000001,Vente,140000,,,LE VILLAGE,B075,02320,02111,Brancourt-en-Laonnois,02,,,021110000C0111,,,,,,,,,,,,,0,,,,,PA,pâtures,,,629,3.421542,49.515089
2020-16989,2020-09-17,000001,Vente,140000,1,,IMP DE LA GRANGE NEUVE,0060,02320,02111,Brancourt-en-Laonnois,02,,,021110000C0112,,,,,,,,,,,,,0,1,Maison,143,7,S,sols,,,830,3.420972,49.514925
2020-16989,2020-09-17,000001,Vente,140000,1,,IMP DE LA GRANGE NEUVE,0060,02320,02111,Brancourt-en-Laonnois,02,,,021110000C0112,,,,,,,,,,,,,0,1,Maison,143,7,J,jardins,,,1625,3.420972,49.514925
2020-16989,2020-09-17,000001,Vente,140000,,,LE MARAIS SOUS LE VILLAGE,B044,02320,02111,Brancourt-en-Laonnois,02,,,021110000C0283,,,,,,,,,,,,,0,,,,,BP,peupleraies,,,385,3.421832,49.515249
2020-16989,2020-09-17,000001,Vente,140000,,,LE MARAIS SOUS LE VILLAGE,B044,02320,02111,Brancourt-en-Laonnois,02,,,021110000C0284,,,,,,,,,,,,,0,,,,,AG,terrains d'agrément,,,364,3.422069,49.515247
2020-16989,2020-09-17,000001,Vente,140000,,,LE MARAIS SOUS LE VILLAGE,B044,02320,02111,Brancourt-en-Laonnois,02,,,021110000C1257,,,,,,,,,,,,,0,,,,,AG,terrains d'agrément,,,888,3.421981,49.515081
2020-17737,2020-11-27,000001,Vente,12765,,,LE CHAMP NININ,B016,02320,02111,Brancourt-en-Laonnois,02,,,02111000ZC0153,,,,,,,,,,,,,0,,,,,T,terres,,,2553,3.421169,49.513474
