id_mutation,date_mutation,numero_disposition,nature_mutation,valeur_fonciere,adresse_numero,adresse_suffixe,adresse_nom_voie,adresse_code_voie,code_postal,code_commune,nom_commune,code_departement,ancien_code_commune,ancien_nom_commune,id_parcelle,ancien_id_parcelle,numero_volume,lot1_numero,lot1_surface_carrez,lot2_numero,lot2_surface_carrez,lot3_numero,lot3_surface_carrez,lot4_numero,lot4_surface_carrez,lot5_numero,lot5_surface_carrez,nombre_lots,code_type_local,type_local,surface_reelle_bati,nombre_pieces_principales,code_nature_culture,nature_culture,code_nature_culture_speciale,nature_culture_speciale,surface_terrain,longitude,latitude
2020-15136,2020-01-10,000001,Vente,90000,30,,RUE PIERRE DUFOURG,0075,02360,02126,Brunehamel,02,,,02126000ZI0009,,,,,,,,,,,,,0,1,Maison,67,3,J,jardins,,,1253,4.186837,49.774857
2020-15136,2020-01-10,000001,Vente,90000,30,,RUE PIERRE DUFOURG,0075,02360,02126,Brunehamel,02,,,02126000ZI0009,,,,,,,,,,,,,0,1,Maison,67,3,S,sols,,,984,4.186837,49.774857
2020-15610,2020-03-11,000001,Vente,111100,30,,RUE DU GRAND CHAMP,0053,02360,02126,Brunehamel,02,,,02126000ZD0034,,,,,,,,,,,,,0,1,Maison,125,7,S,sols,,,945,4.181457,49.775131
2020-15610,2020-03-11,000001,Vente,111100,30,,RUE DU GRAND CHAMP,0053,02360,02126,Brunehamel,02,,,02126000ZD0034,,,,,,,,,,,,,0,1,Maison,125,7,PA,pâtures,,,2497,4.181457,49.775131
2020-15612,2020-03-06,000001,Vente,80000,,,PRE JEAN MOUTON,B060,02360,02126,Brunehamel,02,,,021260000B0639,,,,,,,,,,,,,0,,,,,J,jardins,,,1029,4.181543,49.76815
2020-15612,2020-03-06,000001,Vente,80000,2,,RUE DES BOULEAUX,0017,02360,02126,Brunehamel,02,,,021260000B0643,,,,,,,,,,,,,0,1,Maison,197,6,S,sols,,,392,4.181294,49.768479
2020-16260,2020-06-30,000001,Vente,75000,8,,RUE DE LA GRANDE PORTE,0049,02360,02126,Brunehamel,02,,,021260000B0688,,,,,,,,,,,,,0,1,Maison,107,5,S,sols,,,643,4.177958,49.767651
2020-16473,2020-07-16,000001,Vente,9420,,,BUISSON BONDOS,B009,02360,02126,Brunehamel,02,,,02126000ZK0053,,,,,,,,,,,,,0,,,,,T,terres,,,15700,4.193023,49.763057
2020-16474,2020-07-16,000001,Vente,42297.6,,,BUISSON BONDOS,B009,02360,02126,Brunehamel,02,,,02126000ZK0036,,,,,,,,,,,,,0,,,,,T,terres,,,70496,4.189672,49.762412
2020-16676,2020-07-31,000001,Vente,20000,3,,RUE DES FLEURS,0042,02360,02126,Brunehamel,02,,,021260000B0383,,,,,,,,,,,,,0,1,Maison,100,4,S,sols,,,622,4.183349,49.769306
2020-16676,2020-07-31,000001,Vente,20000,,,DERRIERE L EGLISE,B021,02360,02126,Brunehamel,02,,,021260000B0861,,,,,,,,,,,,,0,,,,,PA,pâtures,,,1231,4.183671,49.769609
2020-16860,2020-09-08,000001,Vente,40000,22,,RUE PRINCIPALE,0094,02360,02126,Brunehamel,02,,,021260000B0112,,,,,,,,,,,,,0,1,Maison,120,5,S,sols,,,607,4.180826,49.768257
2020-17166,2020-10-13,000001,Vente,25000,,,LES CHENNEVIERES,B016,02360,02126,Brunehamel,02,,,02126000ZM0009,,,,,,,,,,,,,0,,,,,PA,pâtures,,,9803,4.170291,49.770485
2020-17166,2020-10-13,000001,Vente,25000,,,LES CHENNEVIERES,B016,02360,02126,Brunehamel,02,,,02126000ZM0010,,,,,,,,,,,,,0,,,,,PA,pâtures,,,4469,4.169737,49.770422
2020-17166,2020-10-13,000001,Vente,25000,,,LES CHENNEVIERES,B016,02360,02126,Brunehamel,02,,,02126000ZM0010,,,,,,,,,,,,,0,,,,,AG,terrains d'agrément,,,4152,4.169737,49.770422
2020-17166,2020-10-13,000001,Vente,25000,,,LES CHENNEVIERES,B016,02360,02126,Brunehamel,02,,,02126000ZM0012,,,,,,,,,,,,,0,,,,,PA,pâtures,,,16718,4.169159,49.770638
2020-17422,2020-10-30,000001,Vente,1400,,,MAISON BONTEMPS,B041,02360,02126,Brunehamel,02,,,02126000ZK0011,,,,,,,,,,,,,0,,,,,PA,pâtures,,,2679,4.189813,49.766272
2020-17492,2020-10-21,000001,Vente,40800,7,,RUE DE L EGLISE,0043,02360,02126,Brunehamel,02,,,021260000B0829,,,,,,,,,,,,,0,,,,,S,sols,,,25,4.182434,49.76946
2020-17492,2020-10-21,000001,Vente,40800,5,,RUE DE L EGLISE,0043,02360,02126,Brunehamel,02,,,021260000B0830,,,,,,,,,,,,,0,1,Maison,93,4,S,sols,,,38,4.182381,49.769454
2020-17492,2020-10-21,000001,Vente,40800,5,,RUE DE L EGLISE,0043,02360,02126,Brunehamel,02,,,021260000B0831,,,,,,,,,,,,,0,,,,,S,sols,,,49,4.182332,49.769451
2020-17492,2020-10-21,000001,Vente,40800,,,RUE DE L EGLISE,0043,02360,02126,Brunehamel,02,,,021260000B0832,,,,,,,,,,,,,0,,,,,S,sols,,,66,4.182381,49.769372
2020-17699,2020-11-17,000001,Vente,40000,3,,RUE DU GRAND CHAMP,0053,02360,02126,Brunehamel,02,,,021260000B0199,,,,,,,,,,,,,0,1,Maison,138,6,S,sols,,,415,4.180533,49.771248
2020-17883,2020-12-04,000001,Vente,14500,,,DEVANT L EGLISE,B026,02360,02126,Brunehamel,02,,,021260000B0714,,,,,,,,,,,,,0,,,,,PA,pâtures,,,342,4.182938,49.769788
