id_mutation,date_mutation,numero_disposition,nature_mutation,valeur_fonciere,adresse_numero,adresse_suffixe,adresse_nom_voie,adresse_code_voie,code_postal,code_commune,nom_commune,code_departement,ancien_code_commune,ancien_nom_commune,id_parcelle,ancien_id_parcelle,numero_volume,lot1_numero,lot1_surface_carrez,lot2_numero,lot2_surface_carrez,lot3_numero,lot3_surface_carrez,lot4_numero,lot4_surface_carrez,lot5_numero,lot5_surface_carrez,nombre_lots,code_type_local,type_local,surface_reelle_bati,nombre_pieces_principales,code_nature_culture,nature_culture,code_nature_culture_speciale,nature_culture_speciale,surface_terrain,longitude,latitude
2020-15226,2020-01-24,000001,Vente,14100,9001,,L HOPITAL,B041,02860,02150,Cerny-en-Laonnois,02,,,021500000B0438,,,,,,,,,,,,,0,1,Maison,18,1,L,landes,,,1805,3.674056,49.445228
2020-15226,2020-01-24,000001,Vente,14100,9001,,L HOPITAL,B041,02860,02150,Cerny-en-Laonnois,02,,,021500000B0438,,,,,,,,,,,,,0,1,Maison,18,1,S,sols,,,100,3.674056,49.445228
2020-16105,2020-05-28,000001,Vente,500,,,ANCIEN VILLAGE,B001,02860,02150,Cerny-en-Laonnois,02,,,021500000A0490,,,,,,,,,,,,,0,,,,,L,landes,,,120,3.673707,49.445607
2020-16105,2020-05-28,000001,Vente,500,,,LES HAUTES BORNES,B040,02860,02150,Cerny-en-Laonnois,02,,,021500000B0385,,,,,,,,,,,,,0,,,,,T,terres,,,380,3.66928,49.442169
2020-16445,2020-07-15,000001,Vente,151000,9,,RUE ST REMY,0025,02860,02150,Cerny-en-Laonnois,02,,,02150000ZD0063,,,,,,,,,,,,,0,,,,,S,sols,,,665,3.667945,49.444135
2020-16445,2020-07-15,000001,Vente,151000,9,,RUE ST REMY,0025,02860,02150,Cerny-en-Laonnois,02,,,02150000ZD0067,,,,,,,,,,,,,0,1,Maison,82,4,S,sols,,,262,3.667866,49.444321
2020-17148,2020-09-25,000001,Vente,64800,7,,RUE ST REMY,0025,02860,02150,Cerny-en-Laonnois,02,,,02150000ZD0072,,,,,,,,,,,,,0,1,Maison,92,6,PA,pâtures,,,652,3.667721,49.444102
2020-17148,2020-09-25,000001,Vente,64800,7,,RUE ST REMY,0025,02860,02150,Cerny-en-Laonnois,02,,,02150000ZD0072,,,,,,,,,,,,,0,1,Maison,92,6,S,sols,,,534,3.667721,49.444102
2020-17697,2020-11-30,000001,Vente,15000,,,LES GRANDS FOSSES,B035,02860,02150,Cerny-en-Laonnois,02,,,021500000A0359,,,,,,,,,,,,,0,,,,,L,landes,,,830,3.683,49.448883
2020-17697,2020-11-30,000001,Vente,15000,,,LES GRANDS FOSSES,B035,02860,02150,Cerny-en-Laonnois,02,,,021500000A0361,,,,,,,,,,,,,0,,,,,L,landes,,,1810,3.683183,49.448762
2020-17697,2020-11-30,000001,Vente,15000,,,LES GRANDS FOSSES,B035,02860,02150,Cerny-en-Laonnois,02,,,021500000A0372,,,,,,,,,,,,,0,,,,,L,landes,,,1605,3.682612,49.447718
2020-17697,2020-11-30,000001,Vente,15000,,,LES GRANDS FOSSES,B035,02860,02150,Cerny-en-Laonnois,02,,,021500000A0373,,,,,,,,,,,,,0,,,,,L,landes,,,4540,3.682681,49.448451
2020-17697,2020-11-30,000001,Vente,15000,,,LES GRANDS FOSSES,B035,02860,02150,Cerny-en-Laonnois,02,,,021500000A0381,,,,,,,,,,,,,0,,,,,L,landes,,,1045,3.68094,49.447785
2020-17697,2020-11-30,000001,Vente,15000,,,LES GRANDS FOSSES,B035,02860,02150,Cerny-en-Laonnois,02,,,021500000A0382,,,,,,,,,,,,,0,,,,,BT,taillis simples,,,1700,3.681151,49.447683
2020-17697,2020-11-30,000001,Vente,15000,,,LES GRANDS FOSSES,B035,02860,02150,Cerny-en-Laonnois,02,,,021500000A0383,,,,,,,,,,,,,0,,,,,T,terres,,,1270,3.68176,49.447515
2020-17697,2020-11-30,000001,Vente,15000,,,LES GRANDS FOSSES,B035,02860,02150,Cerny-en-Laonnois,02,,,021500000A0385,,,,,,,,,,,,,0,,,,,BT,taillis simples,,,1300,3.681222,49.447517
2020-17697,2020-11-30,000001,Vente,15000,,,ANCIEN VILLAGE,B001,02860,02150,Cerny-en-Laonnois,02,,,021500000A0493,,,,,,,,,,,,,0,,,,,L,landes,,,48,3.673352,49.444901
2020-17697,2020-11-30,000001,Vente,15000,,,ANCIEN VILLAGE,B001,02860,02150,Cerny-en-Laonnois,02,,,021500000A0494,,,,,,,,,,,,,0,,,,,L,landes,,,622,3.673118,49.444814
2020-17697,2020-11-30,000001,Vente,15000,,,LES VIGNES,B072,02860,02150,Cerny-en-Laonnois,02,,,021500000A0585,,,,,,,,,,,,,0,,,,,BT,taillis simples,,,600,3.667612,49.449665
2020-17697,2020-11-30,000001,Vente,15000,,,LES GRANDS FOSSES,B035,02860,02150,Cerny-en-Laonnois,02,,,021500000A0840,,,,,,,,,,,,,0,,,,,L,landes,,,2408,3.682191,49.448087
2020-17697,2020-11-30,000001,Vente,15000,,,LE MOULIN MENOT,B050,02860,02150,Cerny-en-Laonnois,02,,,02150000ZD0080,,,,,,,,,,,,,0,,,,,T,terres,,,2000,3.676218,49.449487
2020-17697,2020-11-30,000001,Vente,15000,,,LE MOULIN MENOT,B050,02860,02150,Cerny-en-Laonnois,02,,,02150000ZD0080,,,,,,,,,,,,,0,,,,,PA,pâtures,,,3348,3.676218,49.449487
2020-17697,2020-11-30,000001,Vente,15000,,,LE MOULIN MENOT,B050,02860,02150,Cerny-en-Laonnois,02,,,02150000ZD0080,,,,,,,,,,,,,0,,,,,PA,pâtures,,,1477,3.676218,49.449487
2020-18026,2020-12-21,000001,Vente,97000,7,,RUE ST REMY,0025,02860,02150,Cerny-en-Laonnois,02,,,02150000ZD0072,,,,,,,,,,,,,0,1,Maison,92,6,S,sols,,,534,3.667721,49.444102
2020-18026,2020-12-21,000001,Vente,97000,7,,RUE ST REMY,0025,02860,02150,Cerny-en-Laonnois,02,,,02150000ZD0072,,,,,,,,,,,,,0,1,Maison,92,6,PA,pâtures,,,652,3.667721,49.444102
