id_mutation,date_mutation,numero_disposition,nature_mutation,valeur_fonciere,adresse_numero,adresse_suffixe,adresse_nom_voie,adresse_code_voie,code_postal,code_commune,nom_commune,code_departement,ancien_code_commune,ancien_nom_commune,id_parcelle,ancien_id_parcelle,numero_volume,lot1_numero,lot1_surface_carrez,lot2_numero,lot2_surface_carrez,lot3_numero,lot3_surface_carrez,lot4_numero,lot4_surface_carrez,lot5_numero,lot5_surface_carrez,nombre_lots,code_type_local,type_local,surface_reelle_bati,nombre_pieces_principales,code_nature_culture,nature_culture,code_nature_culture_speciale,nature_culture_speciale,surface_terrain,longitude,latitude
2020-18226,2020-01-13,000001,Vente,1200,,,LE GRAND MARAIS,B098,02270,02306,La Ferté-Chevresis,02,,,02306000ZT0122,,,,,,,,,,,,,0,,,,,PA,pâtures,,,1180,3.551662,49.732857
2020-18226,2020-01-13,000001,Vente,1200,,,LE GRAND MARAIS,B098,02270,02306,La Ferté-Chevresis,02,,,02306000ZT0123,,,,,,,,,,,,,0,,,,,BP,peupleraies,,,770,3.551023,49.732982
2020-18399,2020-02-19,000001,Vente,22000,,,LES GRANDES SOURCES DE PUI,B105,02270,02306,La Ferté-Chevresis,02,,,02306000ZM0120,,,,,,,,,,,,,0,,,,,E,eaux,ETANG,Etangs,4724,3.567107,49.747067
2020-18399,2020-02-19,000001,Vente,22000,,,LES GRANDES SOURCES DE PUI,B105,02270,02306,La Ferté-Chevresis,02,,,02306000ZM0121,,,,,,,,,,,,,0,,,,,PA,pâtures,,,1228,3.567092,49.747023
2020-18444,2020-02-27,000001,Vente,65000,2,,RUE DE LA TOUR,0110,02270,02306,La Ferté-Chevresis,02,,,023060000G0580,,,,,,,,,,,,,0,1,Maison,108,6,S,sols,,,435,3.561167,49.735511
2020-18444,2020-02-27,000001,Vente,65000,,,RUE DE LA TOUR,0110,02270,02306,La Ferté-Chevresis,02,,,023060000G0581,,,,,,,,,,,,,0,,,,,S,sols,,,465,3.561308,49.735361
2020-18691,2020-04-20,000001,Vente,11250,,,LES BAQUETS MAUCLAIRE,B006,02270,02306,La Ferté-Chevresis,02,,,02306000ZP0033,,,,,,,,,,,,,0,,,,,T,terres,,,1420,3.595531,49.733836
2020-18768,2020-04-27,000001,Vente,20270.11,,,LES BAQUETS MAUCLAIRE,B006,02270,02306,La Ferté-Chevresis,02,,,02306000ZP0030,,,,,,,,,,,,,0,,,,,T,terres,,,4980,3.595193,49.734582
2020-18768,2020-04-27,000001,Vente,20270.11,,,LES BAQUETS MAUCLAIRE,B006,02270,02306,La Ferté-Chevresis,02,,,02306000ZP0034,,,,,,,,,,,,,0,,,,,T,terres,,,15290,3.595295,49.733193
2020-19105,2020-07-13,000002,Vente,421.67,,,PUISART,B158,02270,02306,La Ferté-Chevresis,02,,,02306000ZM0139,,,,,,,,,,,,,0,,,,,T,terres,,,556,3.575328,49.748526
2020-19215,2020-07-29,000001,Vente,642800,,,LES BAQUETS MAUCLAIRE,B006,02270,02306,La Ferté-Chevresis,02,,,02306000ZP0027,,,,,,,,,,,,,0,,,,,T,terres,,,7380,3.595834,49.735367
2020-19329,2020-08-07,000001,Vente,121000,,,LA RUE BASSE,B171,02270,02306,La Ferté-Chevresis,02,,,023060000G0334,,,,,,,,,,,,,0,,,,,J,jardins,,,500,3.551522,49.738682
2020-19329,2020-08-07,000001,Vente,121000,,,RUE DE LA FERE,0031,02270,02306,La Ferté-Chevresis,02,,,023060000G0335,,,,,,,,,,,,,0,,,,,S,sols,,,350,3.551724,49.738598
2020-19329,2020-08-07,000001,Vente,121000,,,LA RUE BASSE,B171,02270,02306,La Ferté-Chevresis,02,,,023060000G0336,,,,,,,,,,,,,0,,,,,J,jardins,,,250,3.551533,49.738487
2020-19329,2020-08-07,000001,Vente,121000,7,,RUE DE LA FERE,0031,02270,02306,La Ferté-Chevresis,02,,,023060000G0337,,,,,,,,,,,,,0,1,Maison,44,2,S,sols,,,275,3.551648,49.738449
2020-19363,2020-08-28,000002,Vente,37000,11,,RUE DU PERON,0088,02270,02306,La Ferté-Chevresis,02,,,023060000D0577,,,,,,,,,,,,,0,1,Maison,60,2,S,sols,,,315,3.53825,49.724133
2020-19363,2020-08-28,000002,Vente,37000,,,CHEVRESIS LES DAMES,B048,02270,02306,La Ferté-Chevresis,02,,,023060000D0897,,,,,,,,,,,,,0,,,,,J,jardins,,,187,3.538065,49.724081
2020-19363,2020-08-28,000002,Vente,37000,,,CHEVRESIS LES DAMES,B048,02270,02306,La Ferté-Chevresis,02,,,023060000D0899,,,,,,,,,,,,,0,,,,,J,jardins,,,290,3.538135,49.723985
2020-19484,2020-09-21,000001,Vente,526.33,,,PUISART,B158,02270,02306,La Ferté-Chevresis,02,,,02306000ZM0140,,,,,,,,,,,,,0,,,,,T,terres,,,694,3.576186,49.747963
2020-19535,2020-09-23,000001,Vente,120000,,,LE VILLAGE,B203,02270,02306,La Ferté-Chevresis,02,,,023060000G0124,,,,,,,,,,,,,0,,,,,J,jardins,,,131,3.559164,49.737688
2020-19535,2020-09-23,000001,Vente,120000,2,,RUE DU PT MARAIS,0090,02270,02306,La Ferté-Chevresis,02,,,023060000G0125,,,,,,,,,,,,,0,1,Maison,90,6,S,sols,,,507,3.559097,49.73759
2020-19744,2020-10-28,000001,Vente,105000,14,,RUE D ENFER,0027,02270,02306,La Ferté-Chevresis,02,,,023060000G0187,,,,,,,,,,,,,0,1,Maison,127,4,S,sols,,,460,3.564393,49.738735
2020-19744,2020-10-28,000001,Vente,105000,,,RUE D ENFER,0027,02270,02306,La Ferté-Chevresis,02,,,023060000G0188,,,,,,,,,,,,,0,,,,,S,sols,,,580,3.564627,49.738699
2020-19744,2020-10-28,000001,Vente,105000,,,LE VILLAGE,B203,02270,02306,La Ferté-Chevresis,02,,,023060000G0189,,,,,,,,,,,,,0,,,,,J,jardins,,,880,3.564841,49.738679
2020-19751,2020-10-29,000001,Vente,101500,,,LES LOZEROYS,B123,02270,02306,La Ferté-Chevresis,02,,,02306000ZT0053,,,,,,,,,,,,,0,,,,,BP,peupleraies,,,330,3.552283,49.735249
2020-19751,2020-10-29,000001,Vente,101500,,,LES LOZEROYS,B123,02270,02306,La Ferté-Chevresis,02,,,02306000ZT0053,,,,,,,,,,,,,0,,,,,BP,peupleraies,,,230,3.552283,49.735249
2020-19751,2020-10-29,000001,Vente,101500,,,LES LOZEROYS,B123,02270,02306,La Ferté-Chevresis,02,,,02306000ZT0054,,,,,,,,,,,,,0,,,,,BT,taillis simples,,,29340,3.551236,49.735628
2020-19751,2020-10-29,000001,Vente,101500,,,LES GAILLARDONS,B091,02270,02306,La Ferté-Chevresis,02,,,02306000ZW0051,,,,,,,,,,,,,0,,,,,PA,pâtures,,,440,3.549894,49.73623
2020-19905,2020-11-19,000001,Vente,40000,12,,RUE RENE GUINOT,0100,02270,02306,La Ferté-Chevresis,02,,,023060000G0159,,,,,,,,,,,,,0,1,Maison,71,2,S,sols,,,456,3.55945,49.737434
