id_mutation,date_mutation,numero_disposition,nature_mutation,valeur_fonciere,adresse_numero,adresse_suffixe,adresse_nom_voie,adresse_code_voie,code_postal,code_commune,nom_commune,code_departement,ancien_code_commune,ancien_nom_commune,id_parcelle,ancien_id_parcelle,numero_volume,lot1_numero,lot1_surface_carrez,lot2_numero,lot2_surface_carrez,lot3_numero,lot3_surface_carrez,lot4_numero,lot4_surface_carrez,lot5_numero,lot5_surface_carrez,nombre_lots,code_type_local,type_local,surface_reelle_bati,nombre_pieces_principales,code_nature_culture,nature_culture,code_nature_culture_speciale,nature_culture_speciale,surface_terrain,longitude,latitude
2020-15026,2020-01-13,000001,Vente,870,,,LE BOIS DU MEUNIER,B013,02820,02472,Mauregny-en-Haye,02,,,02472000ZN0109,,,,,,,,,,,,,0,,,,,T,terres,,,1450,3.797644,49.538721
2020-15416,2020-02-18,000001,Vente,38000,25,,RUE CHARLES DE GAULLE,0010,02820,02472,Mauregny-en-Haye,02,,,02472000AB0230,,,,,,,,,,,,,0,1,Maison,93,2,S,sols,,,188,3.792552,49.532591
2020-15416,2020-02-18,000001,Vente,38000,,,LA FORTE TERRE,B079,02820,02472,Mauregny-en-Haye,02,,,02472000AB0232,,,,,,,,,,,,,0,,,,,J,jardins,,,710,3.792187,49.532883
2020-15416,2020-02-18,000001,Vente,38000,27,,RUE CHARLES DE GAULLE,0010,02820,02472,Mauregny-en-Haye,02,,,02472000AB0501,,,,,,,,,,,,,0,,,,,S,sols,,,178,3.792368,49.53259
2020-15934,2020-06-02,000001,Vente,2288,,,LE CHEMIN DE SISSONNE,B042,02820,02472,Mauregny-en-Haye,02,,,02472000ZM0005,,,,,,,,,,,,,0,,,,,BT,taillis simples,,,2288,3.815962,49.567712
2020-16084,2020-05-20,000001,Vente,111000,,,LE CHEMIN DE MARCHAIS,B040,02820,02472,Mauregny-en-Haye,02,,,02472000ZM0048,,,,,,,,,,,,,0,,,,,BT,taillis simples,,,240,3.806403,49.564867
2020-16448,2020-07-01,000001,Vente,10000,,,LE GLANAT,B088,02820,02472,Mauregny-en-Haye,02,,,02472000AC0230,,,,,,,,,,,,,0,,,,,AG,terrains d'agrément,,,428,3.803001,49.532343
2020-16448,2020-07-01,000001,Vente,10000,,,LE GLANAT,B088,02820,02472,Mauregny-en-Haye,02,,,02472000AC0231,,,,,,,,,,,,,0,,,,,BT,taillis simples,,,184,3.803437,49.532452
2020-16448,2020-07-01,000001,Vente,10000,,,LE GLANAT,B088,02820,02472,Mauregny-en-Haye,02,,,02472000AC0232,,,,,,,,,,,,,0,,,,,BT,taillis simples,,,122,3.803436,49.532405
2020-16448,2020-07-01,000001,Vente,10000,,,LE GLANAT,B088,02820,02472,Mauregny-en-Haye,02,,,02472000AC0234,,,,,,,,,,,,,0,,,,,AG,terrains d'agrément,,,119,3.803249,49.532321
2020-16448,2020-07-01,000001,Vente,10000,,,LE GLANAT,B088,02820,02472,Mauregny-en-Haye,02,,,02472000AC0235,,,,,,,,,,,,,0,,,,,AG,terrains d'agrément,,,300,3.803108,49.532261
2020-16448,2020-07-01,000001,Vente,10000,,,LE GLANAT,B088,02820,02472,Mauregny-en-Haye,02,,,02472000AC0237,,,,,,,,,,,,,0,,,,,BT,taillis simples,,,145,3.802614,49.532179
2020-16448,2020-07-01,000001,Vente,10000,,,LE GLANAT,B088,02820,02472,Mauregny-en-Haye,02,,,02472000AC0238,,,,,,,,,,,,,0,,,,,AG,terrains d'agrément,,,347,3.803222,49.532235
2020-16448,2020-07-01,000001,Vente,10000,,,LE GLANAT,B088,02820,02472,Mauregny-en-Haye,02,,,02472000AC0401,,,,,,,,,,,,,0,,,,,BT,taillis simples,,,273,3.802549,49.532287
2020-16490,2020-07-30,000001,Vente,1800,28,,RUE DE LA CROIX,0015,02820,02472,Mauregny-en-Haye,02,,,024720000B0347,,,,,,,,,,,,,0,,,,,J,jardins,,,360,3.795009,49.527501
2020-16490,2020-07-30,000001,Vente,1800,,,LA CROIX,B049,02820,02472,Mauregny-en-Haye,02,,,024720000B0348,,,,,,,,,,,,,0,,,,,J,jardins,,,30,3.795255,49.527553
2020-16490,2020-07-30,000001,Vente,1800,,,LA CROIX,B049,02820,02472,Mauregny-en-Haye,02,,,024720000B0349,,,,,,,,,,,,,0,,,,,J,jardins,,,325,3.795041,49.527438
2020-16788,2020-09-07,000001,Vente,188200,6,B,RUE NOTRE DAME DE LIESSE,0045,02820,02472,Mauregny-en-Haye,02,,,02472000AC0338,,,,,,,,,,,,,0,1,Maison,112,4,S,sols,,,201,3.798427,49.534276
2020-16788,2020-09-07,000001,Vente,188200,6,B,RUE NOTRE DAME DE LIESSE,0045,02820,02472,Mauregny-en-Haye,02,,,02472000AC0339,,,,,,,,,,,,,0,,,,,J,jardins,,,617,3.798685,49.534362
2020-16788,2020-09-07,000001,Vente,188200,6,B,RUE NOTRE DAME DE LIESSE,0045,02820,02472,Mauregny-en-Haye,02,,,02472000AC0417,,,,,,,,,,,,,0,,,,,S,sols,,,350,3.798685,49.534296
2020-17288,2020-10-27,000001,Vente,100,,,L EGLISE,B066,02820,02472,Mauregny-en-Haye,02,,,02472000AB0385,,,,,,,,,,,,,0,,,,,S,sols,,,443,3.795153,49.530868
2020-17292,2020-10-27,000001,Vente,100,,,L EGLISE,B066,02820,02472,Mauregny-en-Haye,02,,,02472000AB0385,,,,,,,,,,,,,0,,,,,S,sols,,,443,3.795153,49.530868
2020-17293,2020-10-28,000001,Vente,156000,11,,RUE DU CHEMIN DE FESTIEUX,0023,02820,02472,Mauregny-en-Haye,02,,,024720000B0001,,,,,,,,,,,,,0,1,Maison,106,4,S,sols,,,307,3.791316,49.530544
2020-17293,2020-10-28,000001,Vente,156000,11,,RUE DU CHEMIN DE FESTIEUX,0023,02820,02472,Mauregny-en-Haye,02,,,024720000B0002,,,,,,,,,,,,,0,,,,,J,jardins,,,322,3.791273,49.530308
2020-17293,2020-10-28,000001,Vente,156000,11,,RUE DU CHEMIN DE FESTIEUX,0023,02820,02472,Mauregny-en-Haye,02,,,024720000B0003,,,,,,,,,,,,,0,,,,,S,sols,,,381,3.791196,49.530481
2020-17380,2020-10-29,000001,Vente,53750,10,,RUE CHARLES DE GAULLE,0010,02820,02472,Mauregny-en-Haye,02,,,02472000AB0255,,,,,,,,,,,,,0,1,Maison,80,4,S,sols,,,435,3.793124,49.532212
2020-17380,2020-10-29,000001,Vente,53750,,,LA RUELLE DE LA TREILLE,B153,02820,02472,Mauregny-en-Haye,02,,,02472000AB0524,,,,,,,,,,,,,0,,,,,J,jardins,,,172,3.793294,49.532297
2020-17381,2020-10-29,000002,Vente,2000,10,,RUE CHARLES DE GAULLE,0010,02820,02472,Mauregny-en-Haye,02,,,02472000AB0258,,,,,,,,,,,,,0,,,,,S,sols,,,145,3.793504,49.532349
2020-17381,2020-10-29,000002,Vente,2000,,,LA RUELLE DE LA TREILLE,B153,02820,02472,Mauregny-en-Haye,02,,,02472000AB0525,,,,,,,,,,,,,0,,,,,J,jardins,,,128,3.793386,49.532363
2020-17675,2020-11-27,000002,Vente,21000,22,,RUE DE L EGLISE,0019,02820,02472,Mauregny-en-Haye,02,,,02472000AB0527,,,,,,,,,,,,,0,1,Maison,72,4,S,sols,,,367,3.796268,49.531393
2020-17696,2020-11-27,000001,Vente,41000,20,T,RUE DE L EGLISE,0019,02820,02472,Mauregny-en-Haye,02,,,02472000AB0047,,,,,,,,,,,,,0,3,Dépendance,,0,S,sols,,,506,3.79616,49.531211
2020-17696,2020-11-27,000001,Vente,41000,,,L EGLISE,B066,02820,02472,Mauregny-en-Haye,02,,,02472000AB0048,,,,,,,,,,,,,0,,,,,J,jardins,,,491,,
2020-17696,2020-11-27,000001,Vente,41000,,,L EGLISE,B066,02820,02472,Mauregny-en-Haye,02,,,02472000AB0049,,,,,,,,,,,,,0,,,,,PA,pâtures,,,1845,3.796561,49.530787
2020-17696,2020-11-27,000001,Vente,41000,22,,RUE DE L EGLISE,0019,02820,02472,Mauregny-en-Haye,02,,,02472000AB0528,,,,,,,,,,,,,0,,,,,S,sols,,,254,,
2020-17724,2020-11-16,000001,Vente,120000,37,,RUE DE LA CROIX,0015,02820,02472,Mauregny-en-Haye,02,,,02472000ZE0006,,,,,,,,,,,,,0,1,Maison,108,4,AG,terrains d'agrément,,,852,3.79663,49.522175
2020-17724,2020-11-16,000001,Vente,120000,37,,RUE DE LA CROIX,0015,02820,02472,Mauregny-en-Haye,02,,,02472000ZE0006,,,,,,,,,,,,,0,1,Maison,108,4,S,sols,,,278,3.79663,49.522175
2020-17724,2020-11-16,000001,Vente,120000,,,LES PRES DU CHEM DE COURTR,B138,02820,02472,Mauregny-en-Haye,02,,,02472000ZE0007,,,,,,,,,,,,,0,,,,,S,sols,,,779,3.796808,49.522335
2020-17724,2020-11-16,000001,Vente,120000,,,LES PRES DU CHEM DE COURTR,B138,02820,02472,Mauregny-en-Haye,02,,,02472000ZE0007,,,,,,,,,,,,,0,,,,,AG,terrains d'agrément,,,1871,3.796808,49.522335
2020-17724,2020-11-16,000001,Vente,120000,,,LES PRES DU CHEM DE COURTR,B138,02820,02472,Mauregny-en-Haye,02,,,02472000ZE0008,,,,,,,,,,,,,0,,,,,BT,taillis simples,,,460,3.797039,49.522485
2020-17724,2020-11-16,000001,Vente,120000,,,LES PRES DU CHEM DE COURTR,B138,02820,02472,Mauregny-en-Haye,02,,,02472000ZE0009,,,,,,,,,,,,,0,,,,,BT,taillis simples,,,1080,3.797176,49.522548
2020-17724,2020-11-16,000001,Vente,120000,,,LES PRES DU CHEM DE COURTR,B138,02820,02472,Mauregny-en-Haye,02,,,02472000ZE0010,,,,,,,,,,,,,0,,,,,BT,taillis simples,,,1270,3.797262,49.522663
