id_mutation,date_mutation,numero_disposition,nature_mutation,valeur_fonciere,adresse_numero,adresse_suffixe,adresse_nom_voie,adresse_code_voie,code_postal,code_commune,nom_commune,code_departement,ancien_code_commune,ancien_nom_commune,id_parcelle,ancien_id_parcelle,numero_volume,lot1_numero,lot1_surface_carrez,lot2_numero,lot2_surface_carrez,lot3_numero,lot3_surface_carrez,lot4_numero,lot4_surface_carrez,lot5_numero,lot5_surface_carrez,nombre_lots,code_type_local,type_local,surface_reelle_bati,nombre_pieces_principales,code_nature_culture,nature_culture,code_nature_culture_speciale,nature_culture_speciale,surface_terrain,longitude,latitude
2020-20614,2020-01-31,000001,Vente,3000000,,,LA HAUTE BORNE,B046,02370,02577,Ostel,02,,,025770000C0131,,,,,,,,,,,,,0,,,,,T,terres,,,20420,3.547494,49.421432
2020-20614,2020-01-31,000001,Vente,3000000,,,LA HAUTE BORNE,B046,02370,02577,Ostel,02,,,025770000C0132,,,,,,,,,,,,,0,,,,,T,terres,,,39386,3.547719,49.422299
2020-20614,2020-01-31,000001,Vente,3000000,,,LA HAUTE BORNE,B046,02370,02577,Ostel,02,,,025770000C0134,,,,,,,,,,,,,0,,,,,T,terres,,,53835,3.544088,49.428457
2020-20614,2020-01-31,000001,Vente,3000000,,,LA HAUTE BORNE,B046,02370,02577,Ostel,02,,,025770000C0134,,,,,,,,,,,,,0,,,,,T,terres,,,53835,3.544088,49.428457
2020-20615,2020-01-31,000001,Vente,450000,,,LA FOSSE MARGUE,B037,02370,02577,Ostel,02,,,025770000C0117,,,,,,,,,,,,,0,,,,,T,terres,,,5200,3.550138,49.415021
2020-20615,2020-01-31,000001,Vente,450000,,,LA FOSSE MARGUE,B037,02370,02577,Ostel,02,,,025770000C0117,,,,,,,,,,,,,0,,,,,T,terres,,,5200,3.550138,49.415021
2020-20615,2020-01-31,000001,Vente,450000,,,LA HAUTE BORNE,B046,02370,02577,Ostel,02,,,025770000C0135,,,,,,,,,,,,,0,,,,,T,terres,,,3060,3.54387,49.426825
2020-20615,2020-01-31,000001,Vente,450000,,,LA HAUTE BORNE,B046,02370,02577,Ostel,02,,,025770000C0135,,,,,,,,,,,,,0,,,,,T,terres,,,3060,3.54387,49.426825
2020-20615,2020-01-31,000001,Vente,450000,,,FOLLE EN PRISE,B031,02370,02577,Ostel,02,,,025770000C0137,,,,,,,,,,,,,0,,,,,T,terres,,,21675,3.546587,49.426485
2020-20615,2020-01-31,000001,Vente,450000,,,FOLLE EN PRISE,B031,02370,02577,Ostel,02,,,025770000C0137,,,,,,,,,,,,,0,,,,,T,terres,,,21675,3.546587,49.426485
2020-20654,2020-02-26,000001,Vente,10000,7,,RUE DU CHATEAU,0010,02370,02577,Ostel,02,,,02577000AB0005,,,,,,,,,,,,,0,3,Dépendance,,0,J,jardins,,,792,3.56879,49.429205
2020-20654,2020-02-26,000001,Vente,10000,7,,RUE DU CHATEAU,0010,02370,02577,Ostel,02,,,02577000AB0005,,,,,,,,,,,,,0,3,Dépendance,,0,S,sols,,,37,3.56879,49.429205
2020-20902,2020-05-12,000001,Vente,140000,3,,RUE DE FILAIN,0015,02370,02577,Ostel,02,,,02577000AB0017,,,,,,,,,,,,,0,1,Maison,134,7,S,sols,,,216,3.569677,49.430136
2020-20902,2020-05-12,000001,Vente,140000,3,,RUE DE FILAIN,0015,02370,02577,Ostel,02,,,02577000AB0017,,,,,,,,,,,,,0,1,Maison,134,7,J,jardins,,,929,3.569677,49.430136
2020-21279,2020-07-01,000001,Vente,8000,,,LE VILLAGE,B086,02370,02577,Ostel,02,,,02577000AB0121,,,,,,,,,,,,,0,,,,,J,jardins,,,459,3.572106,49.429659
2020-21279,2020-07-01,000001,Vente,8000,,,LE VILLAGE,B086,02370,02577,Ostel,02,,,02577000AB0122,,,,,,,,,,,,,0,,,,,J,jardins,,,672,3.572229,49.429739
2020-21279,2020-07-01,000001,Vente,8000,,,LE VILLAGE,B086,02370,02577,Ostel,02,,,02577000AB0122,,,,,,,,,,,,,0,,,,,S,sols,,,380,3.572229,49.429739
2020-21742,2020-09-29,000001,Vente,185500,8,,RUE DU CHATEAU,0010,02370,02577,Ostel,02,,,02577000AB0130,,,,,,,,,,,,,0,1,Maison,99,4,S,sols,,,424,3.568611,49.428717
2020-21742,2020-09-29,000001,Vente,185500,8,,RUE DU CHATEAU,0010,02370,02577,Ostel,02,,,02577000AB0130,,,,,,,,,,,,,0,1,Maison,190,6,S,sols,,,424,3.568611,49.428717
2020-21742,2020-09-29,000001,Vente,185500,,,LE VILLAGE,B086,02370,02577,Ostel,02,,,02577000AB0133,,,,,,,,,,,,,0,,,,,J,jardins,,,486,3.568822,49.428537
2020-21780,2020-09-30,000001,Vente,2500,,,LA POINTE DU MONQUOIR,B070,02370,02577,Ostel,02,,,025770000A0085,,,,,,,,,,,,,0,,,,,BT,taillis simples,,,1183,3.566816,49.438927
2020-21780,2020-09-30,000001,Vente,2500,,,LA GLAUX,B040,02370,02577,Ostel,02,,,025770000A0241,,,,,,,,,,,,,0,,,,,L,landes,,,4420,3.573626,49.426972
2020-21780,2020-09-30,000001,Vente,2500,,,LA GLAUX,B040,02370,02577,Ostel,02,,,025770000A0242,,,,,,,,,,,,,0,,,,,BT,taillis simples,,,2060,3.573263,49.426704
2020-21780,2020-09-30,000001,Vente,2500,,,LA GLAUX,B040,02370,02577,Ostel,02,,,025770000A0243,,,,,,,,,,,,,0,,,,,BT,taillis simples,,,616,3.573112,49.427259
2020-21780,2020-09-30,000001,Vente,2500,,,LA GLAUX,B040,02370,02577,Ostel,02,,,025770000A0244,,,,,,,,,,,,,0,,,,,L,landes,,,774,3.573271,49.427396
