id_mutation,date_mutation,numero_disposition,nature_mutation,valeur_fonciere,adresse_numero,adresse_suffixe,adresse_nom_voie,adresse_code_voie,code_postal,code_commune,nom_commune,code_departement,ancien_code_commune,ancien_nom_commune,id_parcelle,ancien_id_parcelle,numero_volume,lot1_numero,lot1_surface_carrez,lot2_numero,lot2_surface_carrez,lot3_numero,lot3_surface_carrez,lot4_numero,lot4_surface_carrez,lot5_numero,lot5_surface_carrez,nombre_lots,code_type_local,type_local,surface_reelle_bati,nombre_pieces_principales,code_nature_culture,nature_culture,code_nature_culture_speciale,nature_culture_speciale,surface_terrain,longitude,latitude
2020-15117,2020-01-24,000001,Vente,2423,,,LES COUTURES,B044,02860,02621,Presles-et-Thierny,02,,,026210000B0391,,,,,,,,,,,,,0,,,,,BS,taillis sous futaie,,,184,3.618786,49.509477
2020-15117,2020-01-24,000001,Vente,2423,,,LES PRES DES COUTURES,B084,02860,02621,Presles-et-Thierny,02,,,026210000B0501,,,,,,,,,,,,,0,,,,,PA,pâtures,,,839,3.617191,49.508837
2020-15273,2020-02-03,000001,Vente,191.22,,,LES GRANDES VIGNES,B055,02860,02621,Presles-et-Thierny,02,,,026210000C0370,,,,,,,,,,,,,0,,,,,BP,peupleraies,,,299,3.627943,49.50451
2020-15273,2020-02-03,000001,Vente,191.22,,,LES GRANDES VIGNES,B055,02860,02621,Presles-et-Thierny,02,,,026210000C0372,,,,,,,,,,,,,0,,,,,BS,taillis sous futaie,,,846,3.627642,49.50453
2020-15286,2020-02-17,000001,Vente,49886.5,,,CORNEIL,B043,02860,02621,Presles-et-Thierny,02,,,026210000A0028,,,,,,,,,,,,,0,,,,,BP,peupleraies,,,3752,3.624258,49.528518
2020-15286,2020-02-17,000001,Vente,49886.5,,,LE PRE LEVEQUE,B081,02860,02621,Presles-et-Thierny,02,,,026210000A0111,,,,,,,,,,,,,0,,,,,BS,taillis sous futaie,,,11227,3.631705,49.52781
2020-15286,2020-02-17,000001,Vente,49886.5,,,LE PRE LEVEQUE,B081,02860,02621,Presles-et-Thierny,02,,,026210000A0113,,,,,,,,,,,,,0,,,,,BS,taillis sous futaie,,,2192,3.631015,49.527798
2020-15286,2020-02-17,000001,Vente,49886.5,,,LE PRE LEVEQUE,B081,02860,02621,Presles-et-Thierny,02,,,026210000A0114,,,,,,,,,,,,,0,,,,,BS,taillis sous futaie,,,16380,3.630303,49.527914
2020-15286,2020-02-17,000001,Vente,49886.5,,,LE PRE LEVEQUE,B081,02860,02621,Presles-et-Thierny,02,,,026210000A0115,,,,,,,,,,,,,0,,,,,BS,taillis sous futaie,,,3892,3.629336,49.528404
2020-15286,2020-02-17,000001,Vente,49886.5,,,LE PRE LEVEQUE,B081,02860,02621,Presles-et-Thierny,02,,,026210000A0117,,,,,,,,,,,,,0,,,,,BP,peupleraies,,,1312,3.628736,49.528055
2020-15286,2020-02-17,000001,Vente,49886.5,,,LE PRE LEVEQUE,B081,02860,02621,Presles-et-Thierny,02,,,026210000A0120,,,,,,,,,,,,,0,,,,,BP,peupleraies,,,1460,3.627936,49.528604
2020-15286,2020-02-17,000001,Vente,49886.5,,,LE PRE LEVEQUE,B081,02860,02621,Presles-et-Thierny,02,,,026210000A0122,,,,,,,,,,,,,0,,,,,BP,peupleraies,,,4836,3.627503,49.528543
2020-15286,2020-02-17,000001,Vente,49886.5,,,LE PRE LEVEQUE,B081,02860,02621,Presles-et-Thierny,02,,,026210000A0123,,,,,,,,,,,,,0,,,,,BP,peupleraies,,,15007,3.625924,49.52863
2020-15286,2020-02-17,000001,Vente,49886.5,,,LE PRE LEVEQUE,B081,02860,02621,Presles-et-Thierny,02,,,026210000A0125,,,,,,,,,,,,,0,,,,,BP,peupleraies,,,2354,3.625105,49.528825
2020-15286,2020-02-17,000001,Vente,49886.5,,,LE CHEMIN DE LAON OUEST,B033,02860,02621,Presles-et-Thierny,02,,,026210000A0223,,,,,,,,,,,,,0,,,,,BP,peupleraies,,,36888,3.633593,49.526532
2020-15286,2020-02-17,000001,Vente,49886.5,,,LE CHEMIN DE LAON OUEST,B033,02860,02621,Presles-et-Thierny,02,,,026210000A0230,,,,,,,,,,,,,0,,,,,BP,peupleraies,,,473,3.633159,49.527062
2020-15493,2020-02-21,000001,Vente,160000,,,LE VILLAGE,B101,02860,02621,Presles-et-Thierny,02,,,026210000C0074,,,,,,,,,,,,,0,,,,,J,jardins,,,1802,3.627932,49.507556
2020-15493,2020-02-21,000001,Vente,160000,25,,RUE DE L EGLISE,0021,02860,02621,Presles-et-Thierny,02,,,026210000C0075,,,,,,,,,,,,,0,1,Maison,100,6,S,sols,,,273,3.627553,49.507485
2020-15493,2020-02-21,000001,Vente,160000,25,,RUE DE L EGLISE,0021,02860,02621,Presles-et-Thierny,02,,,026210000C0076,,,,,,,,,,,,,0,,,,,S,sols,,,1212,3.627277,49.507543
2020-15493,2020-02-21,000001,Vente,160000,,,LE VILLAGE,B101,02860,02621,Presles-et-Thierny,02,,,026210000C0077,,,,,,,,,,,,,0,,,,,S,sols,,,900,3.628013,49.50796
2020-15493,2020-02-21,000001,Vente,160000,,,LE VILLAGE,B101,02860,02621,Presles-et-Thierny,02,,,026210000C0077,,,,,,,,,,,,,0,,,,,PA,pâtures,,,3098,3.628013,49.50796
2020-15493,2020-02-21,000001,Vente,160000,,,LE VILLAGE,B101,02860,02621,Presles-et-Thierny,02,,,026210000C0695,,,,,,,,,,,,,0,,,,,S,sols,,,1750,3.627248,49.507816
2020-15533,2020-03-06,000001,Vente,45000,,,LE PONCEAU,B080,02860,02621,Presles-et-Thierny,02,,,026210000B0123,,,,,,,,,,,,,0,,,,,T,terres,,,311,3.624682,49.512314
2020-15533,2020-03-06,000001,Vente,45000,,,LE PONCEAU,B080,02860,02621,Presles-et-Thierny,02,,,026210000B0124,,,,,,,,,,,,,0,,,,,T,terres,,,161,3.624761,49.512366
2020-15533,2020-03-06,000001,Vente,45000,,,LE PONCEAU,B080,02860,02621,Presles-et-Thierny,02,,,026210000B0125,,,,,,,,,,,,,0,,,,,T,terres,,,187,3.624777,49.512385
2020-15533,2020-03-06,000001,Vente,45000,,,LE PONCEAU,B080,02860,02621,Presles-et-Thierny,02,,,026210000B0126,,,,,,,,,,,,,0,,,,,J,jardins,,,187,3.624814,49.512428
2020-16130,2020-06-04,000001,Vente,159000,6,,RTE DE NOUVION,0056,02860,02621,Presles-et-Thierny,02,,,026210000B0520,,,,,,,,,,,,,0,1,Maison,145,5,S,sols,,,1050,3.623663,49.510697
2020-16130,2020-06-04,000001,Vente,159000,,,LA RUELLE PLONTAINE,B091,02860,02621,Presles-et-Thierny,02,,,026210000B0585,,,,,,,,,,,,,0,,,,,PA,pâtures,,,1168,3.623159,49.510714
2020-16244,2020-06-08,000001,Vente,86555,,,LES GREZILS,B056,02860,02621,Presles-et-Thierny,02,,,026210000D0247,,,,,,,,,,,,,0,,,,,BT,taillis simples,,,132,3.633213,49.513322
2020-16244,2020-06-08,000001,Vente,86555,,,LES GREZILS,B056,02860,02621,Presles-et-Thierny,02,,,026210000D0254,,,,,,,,,,,,,0,,,,,BS,taillis sous futaie,,,699,3.635634,49.513046
2020-16244,2020-06-08,000001,Vente,86555,,,LES GREZILS,B056,02860,02621,Presles-et-Thierny,02,,,026210000D0258,,,,,,,,,,,,,0,,,,,BS,taillis sous futaie,,,1895,3.636769,49.513715
2020-16244,2020-06-08,000001,Vente,86555,,,AU-DESSUS DU CHEMIN DE VOR,B004,02860,02621,Presles-et-Thierny,02,,,026210000D0287,,,,,,,,,,,,,0,,,,,BS,taillis sous futaie,,,1036,3.635799,49.513936
2020-16244,2020-06-08,000001,Vente,86555,,,AU-DESSUS DU CHEMIN DE VOR,B004,02860,02621,Presles-et-Thierny,02,,,026210000D0289,,,,,,,,,,,,,0,,,,,BS,taillis sous futaie,,,650,3.635314,49.513844
2020-16244,2020-06-08,000001,Vente,86555,,,AU-DESSUS DU CHEMIN DE VOR,B004,02860,02621,Presles-et-Thierny,02,,,026210000D0290,,,,,,,,,,,,,0,,,,,BS,taillis sous futaie,,,1520,3.63496,49.51387
2020-16244,2020-06-08,000001,Vente,86555,,,AU-DESSUS DU CHEMIN DE VOR,B004,02860,02621,Presles-et-Thierny,02,,,026210000D0291,,,,,,,,,,,,,0,,,,,PA,pâtures,,,1698,3.634778,49.513487
2020-16244,2020-06-08,000001,Vente,86555,,,AU-DESSUS DU CHEMIN DE VOR,B004,02860,02621,Presles-et-Thierny,02,,,026210000D0292,,,,,,,,,,,,,0,,,,,PA,pâtures,,,743,3.634428,49.513614
2020-16244,2020-06-08,000001,Vente,86555,,,AU-DESSUS DU CHEMIN DE VOR,B004,02860,02621,Presles-et-Thierny,02,,,026210000D0292,,,,,,,,,,,,,0,,,,,BS,taillis sous futaie,,,551,3.634428,49.513614
2020-16244,2020-06-08,000001,Vente,86555,,,AU-DESSUS DU CHEMIN DE VOR,B004,02860,02621,Presles-et-Thierny,02,,,026210000D0294,,,,,,,,,,,,,0,,,,,BS,taillis sous futaie,,,2195,3.634033,49.513663
2020-16244,2020-06-08,000001,Vente,86555,,,AU-DESSUS DU CHEMIN DE VOR,B004,02860,02621,Presles-et-Thierny,02,,,026210000D0295,,,,,,,,,,,,,0,,,,,BS,taillis sous futaie,,,731,3.63445,49.513999
2020-16244,2020-06-08,000001,Vente,86555,7,,VC LA FRANCHE RUE,0032,02860,02621,Presles-et-Thierny,02,,,026210000D0413,,,,,,,,,,,,,0,,,,,S,sols,,,578,3.631673,49.513961
2020-16244,2020-06-08,000001,Vente,86555,,,THIERNY,B097,02860,02621,Presles-et-Thierny,02,,,026210000D0416,,,,,,,,,,,,,0,,,,,PA,pâtures,,,553,3.631618,49.51383
2020-16348,2020-07-13,000001,Vente,292.25,,,LES BEAUX SEINS,B007,02860,02621,Presles-et-Thierny,02,,,026210000C0400,,,,,,,,,,,,,0,,,,,T,terres,,,846,3.626548,49.504647
2020-16409,2020-07-23,000002,Vente,185000,9,B,GR LA GRAND RUE,0033,02860,02621,Presles-et-Thierny,02,,,026210000B0615,,,,,,,,,,,,,0,1,Maison,120,4,,,,,,3.625773,49.512769
2020-16794,2020-09-02,000001,Vente,117800,15,,RUE DE L EGLISE,0021,02860,02621,Presles-et-Thierny,02,,,026210000C0696,,,,,,,,,,,,,0,1,Maison,66,3,S,sols,,,245,3.626526,49.50865
2020-16794,2020-09-02,000001,Vente,117800,,,LE VILLAGE,B101,02860,02621,Presles-et-Thierny,02,,,026210000C0697,,,,,,,,,,,,,0,,,,,S,sols,,,22,3.626662,49.508676
2020-16961,2020-09-17,000001,Vente,69120.4,,,CORNEIL,B043,02860,02621,Presles-et-Thierny,02,,,026210000A0011,,,,,,,,,,,,,0,,,,,T,terres,,,37586,3.618331,49.525571
2020-16961,2020-09-17,000001,Vente,69120.4,,,CORNEIL,B043,02860,02621,Presles-et-Thierny,02,,,026210000A0013,,,,,,,,,,,,,0,,,,,T,terres,,,14619,3.616491,49.52571
2020-17088,2020-10-05,000001,Vente,115000,4,,VOY DE LEUILLY,0067,02860,02621,Presles-et-Thierny,02,,,026210000B0249,,,,,,,,,,,,,0,1,Maison,136,5,S,sols,,,528,3.622177,49.509157
2020-17088,2020-10-05,000001,Vente,115000,4,,VOY DE LEUILLY,0067,02860,02621,Presles-et-Thierny,02,,,026210000B0249,,,,,,,,,,,,,0,1,Maison,43,2,S,sols,,,528,3.622177,49.509157
2020-17088,2020-10-05,000001,Vente,115000,6,,VOY DE LEUILLY,0067,02860,02621,Presles-et-Thierny,02,,,026210000B0513,,,,,,,,,,,,,0,,,,,S,sols,,,543,3.622103,49.509324
2020-17088,2020-10-05,000001,Vente,115000,6,,VOY DE LEUILLY,0067,02860,02621,Presles-et-Thierny,02,,,026210000B0513,,,,,,,,,,,,,0,,,,,J,jardins,,,700,3.622103,49.509324
2020-17354,2020-10-27,000001,Vente,2000,,,LE PONCEAU,B080,02860,02621,Presles-et-Thierny,02,,,026210000B0122,,,,,,,,,,,,,0,,,,,PA,pâtures,,,169,3.624405,49.512453
2020-17354,2020-10-27,000001,Vente,2000,,,LE PONCEAU,B080,02860,02621,Presles-et-Thierny,02,,,026210000B0127,,,,,,,,,,,,,0,,,,,T,terres,,,228,3.624336,49.512541
2020-17354,2020-10-27,000001,Vente,2000,,,LE PONCEAU,B080,02860,02621,Presles-et-Thierny,02,,,026210000B0128,,,,,,,,,,,,,0,,,,,T,terres,,,276,3.624427,49.512592
2020-17354,2020-10-27,000001,Vente,2000,,,LE PONCEAU,B080,02860,02621,Presles-et-Thierny,02,,,026210000B0129,,,,,,,,,,,,,0,,,,,BS,taillis sous futaie,,,457,3.62394,49.512656
2020-17354,2020-10-27,000001,Vente,2000,,,LE PONCEAU,B080,02860,02621,Presles-et-Thierny,02,,,026210000B0130,,,,,,,,,,,,,0,,,,,BS,taillis sous futaie,,,227,3.623959,49.512761
2020-17354,2020-10-27,000001,Vente,2000,,,LE PONCEAU,B080,02860,02621,Presles-et-Thierny,02,,,026210000B0131,,,,,,,,,,,,,0,,,,,T,terres,,,183,3.62435,49.512664
2020-17555,2020-11-03,000001,Vente,3500,,,LE CHEMIN DE VORGES-SUD,B038,02860,02621,Presles-et-Thierny,02,,,026210000D0357,,,,,,,,,,,,,0,,,,,T,terres,,,2702,3.63383,49.514525
2020-17555,2020-11-03,000001,Vente,3500,,,AU-DESSUS DU CHEMIN DE VOR,B004,02860,02621,Presles-et-Thierny,02,,,026210000D0360,,,,,,,,,,,,,0,,,,,BT,taillis simples,,,2608,3.634039,49.514123
2020-18097,2020-12-29,000001,Vente,1350,,,AU-DESSUS DU CHEMIN DE VOR,B004,02860,02621,Presles-et-Thierny,02,,,026210000D0359,,,,,,,,,,,,,0,,,,,BT,taillis simples,,,2704,3.634804,49.514312
