id_mutation,date_mutation,numero_disposition,nature_mutation,valeur_fonciere,adresse_numero,adresse_suffixe,adresse_nom_voie,adresse_code_voie,code_postal,code_commune,nom_commune,code_departement,ancien_code_commune,ancien_nom_commune,id_parcelle,ancien_id_parcelle,numero_volume,lot1_numero,lot1_surface_carrez,lot2_numero,lot2_surface_carrez,lot3_numero,lot3_surface_carrez,lot4_numero,lot4_surface_carrez,lot5_numero,lot5_surface_carrez,nombre_lots,code_type_local,type_local,surface_reelle_bati,nombre_pieces_principales,code_nature_culture,nature_culture,code_nature_culture_speciale,nature_culture_speciale,surface_terrain,longitude,latitude
2020-23613,2020-01-14,000001,Vente,41000,,,SAUVIGNY HAMEAU,B099,02850,02645,Reuilly-Sauvigny,02,,,02645000ZC0057,,,,,,,,,,,,,0,,,,,P,prés,,,1781,3.574397,49.054266
2020-23613,2020-01-14,000001,Vente,41000,,,SAUVIGNY HAMEAU,B099,02850,02645,Reuilly-Sauvigny,02,,,02645000ZC0057,,,,,,,,,,,,,0,,,,,S,sols,,,1000,3.574397,49.054266
2020-23626,2020-01-14,000001,Vente,1112.4,,,SAUVIGNY HAMEAU,B099,02850,02645,Reuilly-Sauvigny,02,,,02645000ZC0057,,,,,,,,,,,,,0,,,,,S,sols,,,1000,3.574397,49.054266
2020-23626,2020-01-14,000001,Vente,1112.4,,,SAUVIGNY HAMEAU,B099,02850,02645,Reuilly-Sauvigny,02,,,02645000ZC0057,,,,,,,,,,,,,0,,,,,P,prés,,,1781,3.574397,49.054266
2020-24354,2020-07-16,000001,Vente,120800,7,,RUE DE L'EGLISE,0010,02850,02645,Reuilly-Sauvigny,02,,,02645000ZB0072,,,,,,,,,,,,,0,1,Maison,89,4,J,jardins,,,2174,3.5581,49.05978
2020-24354,2020-07-16,000001,Vente,120800,7,,RUE DE L'EGLISE,0010,02850,02645,Reuilly-Sauvigny,02,,,02645000ZB0072,,,,,,,,,,,,,0,1,Maison,89,4,S,sols,,,500,3.5581,49.05978
2020-24454,2020-08-28,000001,Vente,45000,16,,RUE MEDARD BOURGEOTTE,0044,02850,02645,Reuilly-Sauvigny,02,,,026450000B2450,,,,,,,,,,,,,0,1,Maison,45,3,S,sols,,,413,3.577297,49.054549
2020-24454,2020-08-28,000001,Vente,45000,16,,RUE MEDARD BOURGEOTTE,0044,02850,02645,Reuilly-Sauvigny,02,,,026450000B2450,,,,,,,,,,,,,0,1,Maison,45,3,J,jardins,,,821,3.577297,49.054549
2020-24460,2020-08-19,000001,Vente,137000,5001,,RUE GENERAL DEGOUTTE,0020,02850,02645,Reuilly-Sauvigny,02,,,02645000ZE0110,,,,,,,,,,,,,0,1,Maison,96,3,J,jardins,,,838,3.577657,49.052255
2020-24460,2020-08-19,000001,Vente,137000,5001,,RUE GENERAL DEGOUTTE,0020,02850,02645,Reuilly-Sauvigny,02,,,02645000ZE0110,,,,,,,,,,,,,0,1,Maison,96,3,S,sols,,,320,3.577657,49.052255
2020-24489,2020-09-01,000001,Vente,15000,,,LA PRESLE,B091,02850,02645,Reuilly-Sauvigny,02,,,02645000ZI0075,,,,,,,,,,,,,0,,,,,P,prés,,,999,3.579291,49.053139
2020-24489,2020-09-01,000001,Vente,15000,,,LA PRESLE,B091,02850,02645,Reuilly-Sauvigny,02,,,02645000ZI0077,,,,,,,,,,,,,0,,,,,P,prés,,,2073,3.579488,49.053585
2020-24489,2020-09-01,000001,Vente,15000,,,LA PRESLE,B091,02850,02645,Reuilly-Sauvigny,02,,,02645000ZI0077,,,,,,,,,,,,,0,,,,,T,terres,,,277,3.579488,49.053585
2020-24845,2020-10-30,000001,Vente,165000,7,,RUE DU CLOS DES FONTAINES,0007,02850,02645,Reuilly-Sauvigny,02,,,026450000B0174,,,,,,,,,,,,,0,1,Maison,128,5,S,sols,,,798,3.577604,49.053554
2020-25111,2020-12-23,000001,Vente,12000,,,SAUVIGNY HAMEAU,B099,02850,02645,Reuilly-Sauvigny,02,,,026450000B2225,,,,,,,,,,,,,0,,,,,S,sols,,,67,3.578518,49.053732
2020-25111,2020-12-23,000001,Vente,12000,,,SAUVIGNY HAMEAU,B099,02850,02645,Reuilly-Sauvigny,02,,,026450000B2226,,,,,,,,,,,,,0,,,,,S,sols,,,37,3.578492,49.053689
2020-25111,2020-12-23,000001,Vente,12000,,,SAUVIGNY HAMEAU,B099,02850,02645,Reuilly-Sauvigny,02,,,026450000B2230,,,,,,,,,,,,,0,,,,,S,sols,,,83,3.578422,49.053624
2020-25112,2020-12-23,000002,Vente,108500,,,SAUVIGNY HAMEAU,B099,02850,02645,Reuilly-Sauvigny,02,,,026450000B2226,,,,,,,,,,,,,0,,,,,S,sols,,,37,3.578492,49.053689
2020-25112,2020-12-23,000002,Vente,108500,,,SAUVIGNY HAMEAU,B099,02850,02645,Reuilly-Sauvigny,02,,,026450000B2227,,,,,,,,,,,,,0,,,,,S,sols,,,171,3.578659,49.053655
2020-25112,2020-12-23,000002,Vente,108500,9,,RUE DE BELLEVUE,0003,02850,02645,Reuilly-Sauvigny,02,,,026450000B2228,,,,,,,,,,,,,0,1,Maison,40,1,S,sols,,,49,3.578596,49.053557
2020-25112,2020-12-23,000002,Vente,108500,,,SAUVIGNY HAMEAU,B099,02850,02645,Reuilly-Sauvigny,02,,,026450000B2229,,,,,,,,,,,,,0,,,,,S,sols,,,68,3.578519,49.053598
2020-25112,2020-12-23,000002,Vente,108500,,,SAUVIGNY HAMEAU,B099,02850,02645,Reuilly-Sauvigny,02,,,026450000B2235,,,,,,,,,,,,,0,,,,,P,prés,,,932,3.578924,49.053477
