id_mutation,date_mutation,numero_disposition,nature_mutation,valeur_fonciere,adresse_numero,adresse_suffixe,adresse_nom_voie,adresse_code_voie,code_postal,code_commune,nom_commune,code_departement,ancien_code_commune,ancien_nom_commune,id_parcelle,ancien_id_parcelle,numero_volume,lot1_numero,lot1_surface_carrez,lot2_numero,lot2_surface_carrez,lot3_numero,lot3_surface_carrez,lot4_numero,lot4_surface_carrez,lot5_numero,lot5_surface_carrez,nombre_lots,code_type_local,type_local,surface_reelle_bati,nombre_pieces_principales,code_nature_culture,nature_culture,code_nature_culture_speciale,nature_culture_speciale,surface_terrain,longitude,latitude
2020-33260,2020-01-17,000001,Vente,40000,7037,,LE VILLAGE,B091,04340,04102,Le Lauzet-Ubaye,04,,,041020000G0309,,,6,26.6,,,,,,,,,1,2,Appartement,27,2,,,,,,6.43666,44.426369
2020-35283,2020-08-05,000001,Vente,32250,,,LA BLACHE,B011,04340,04102,Le Lauzet-Ubaye,04,,,041020000A0349,,,,,,,,,,,,,0,,,,,BR,futaies résineuses,,,8620,6.418127,44.44237
2020-35283,2020-08-05,000001,Vente,32250,,,LA BLACHE,B011,04340,04102,Le Lauzet-Ubaye,04,,,041020000A0350,,,,,,,,,,,,,0,,,,,L,landes,PATUR,Pâture plantée,3135,6.417832,44.442094
2020-35283,2020-08-05,000001,Vente,32250,,,LA BLACHE,B011,04340,04102,Le Lauzet-Ubaye,04,,,041020000A0352,,,,,,,,,,,,,0,,,,,BR,futaies résineuses,,,9048,6.416742,44.441816
2020-35283,2020-08-05,000001,Vente,32250,7065,,LA BLACHE,B011,04340,04102,Le Lauzet-Ubaye,04,,,041020000A0353,,,,,,,,,,,,,0,1,Maison,34,2,S,sols,,,39,6.417723,44.441811
2020-35283,2020-08-05,000001,Vente,32250,,,LA BLACHE,B011,04340,04102,Le Lauzet-Ubaye,04,,,041020000A0372,,,,,,,,,,,,,0,,,,,L,landes,PATUR,Pâture plantée,7790,6.417818,44.441656
2020-35906,2020-09-24,000001,Vente,4800,7105,,LES VIGNES,B090,04340,04102,Le Lauzet-Ubaye,04,,,041020000H0193,,,,,,,,,,,,,0,3,Dépendance,,0,L,landes,PATUR,Pâture plantée,4710,6.361418,44.468636
2020-36843,2020-12-03,000001,Vente,150000,,,CHEIGNIEES,B026,04340,04102,Le Lauzet-Ubaye,04,,,041020000D0582,,,,,,,,,,,,,0,,,,,P,prés,,,1144,6.452101,44.407995
2020-36843,2020-12-03,000001,Vente,150000,7006,,CHEIGNIEES,B026,04340,04102,Le Lauzet-Ubaye,04,,,041020000D0583,,,,,,,,,,,,,0,3,Dépendance,,0,S,sols,,,1094,6.451906,44.407848
2020-36843,2020-12-03,000001,Vente,150000,7006,,CHEIGNIEES,B026,04340,04102,Le Lauzet-Ubaye,04,,,041020000D0583,,,,,,,,,,,,,0,1,Maison,44,2,S,sols,,,1094,6.451906,44.407848
2020-37162,2020-11-27,000001,Vente,190000,7018,,LE VILLAGE,B091,04340,04102,Le Lauzet-Ubaye,04,,,041020000G0256,,,,,,,,,,,,,0,2,Appartement,85,3,S,sols,,,326,6.430996,44.430051
2020-37162,2020-11-27,000001,Vente,190000,7018,,LE VILLAGE,B091,04340,04102,Le Lauzet-Ubaye,04,,,041020000G0256,,,,,,,,,,,,,0,2,Appartement,83,4,S,sols,,,326,6.430996,44.430051
2020-37162,2020-11-27,000001,Vente,190000,7019,,LE VILLAGE,B091,04340,04102,Le Lauzet-Ubaye,04,,,041020000G0257,,,,,,,,,,,,,0,1,Maison,44,2,S,sols,,,236,6.430938,44.43014
