id_mutation,date_mutation,numero_disposition,nature_mutation,valeur_fonciere,adresse_numero,adresse_suffixe,adresse_nom_voie,adresse_code_voie,code_postal,code_commune,nom_commune,code_departement,ancien_code_commune,ancien_nom_commune,id_parcelle,ancien_id_parcelle,numero_volume,lot1_numero,lot1_surface_carrez,lot2_numero,lot2_surface_carrez,lot3_numero,lot3_surface_carrez,lot4_numero,lot4_surface_carrez,lot5_numero,lot5_surface_carrez,nombre_lots,code_type_local,type_local,surface_reelle_bati,nombre_pieces_principales,code_nature_culture,nature_culture,code_nature_culture_speciale,nature_culture_speciale,surface_terrain,longitude,latitude
2020-78824,2020-02-06,000001,Vente,235000,,,COSTE LA BEAUME,B025,07120,07023,Balazuc,07,,,070230000C1631,,,,,,,,,,,,,0,,,,,L,landes,,,190,4.377109,44.509077
2020-78824,2020-02-06,000001,Vente,235000,266,,IMP DE COSTE LA BEAUME,0173,07120,07023,Balazuc,07,,,070230000C1633,,,,,,,,,,,,,0,3,Dépendance,,0,J,jardins,,,1000,4.377633,44.509061
2020-78824,2020-02-06,000001,Vente,235000,266,,IMP DE COSTE LA BEAUME,0173,07120,07023,Balazuc,07,,,070230000C1633,,,,,,,,,,,,,0,3,Dépendance,,0,S,sols,,,745,4.377633,44.509061
2020-78824,2020-02-06,000001,Vente,235000,266,,IMP DE COSTE LA BEAUME,0173,07120,07023,Balazuc,07,,,070230000C1633,,,,,,,,,,,,,0,1,Maison,99,6,S,sols,,,745,4.377633,44.509061
2020-78824,2020-02-06,000001,Vente,235000,266,,IMP DE COSTE LA BEAUME,0173,07120,07023,Balazuc,07,,,070230000C1633,,,,,,,,,,,,,0,1,Maison,99,6,J,jardins,,,1000,4.377633,44.509061
2020-78824,2020-02-06,000001,Vente,235000,,,COSTE LA BEAUME,B025,07120,07023,Balazuc,07,,,070230000C1635,,,,,,,,,,,,,0,,,,,L,landes,,,3030,4.377843,44.509662
2020-78877,2020-02-13,000001,Vente,110000,,,TRANLATOUR,B058,07120,07023,Balazuc,07,,,070230000C0404,,,,,,,,,,,,,0,,,,,T,terres,,,1150,,
2020-78877,2020-02-13,000001,Vente,110000,,,TRANLATOUR,B058,07120,07023,Balazuc,07,,,070230000C0408,,,,,,,,,,,,,0,,,,,T,terres,,,1000,,
2020-79882,2020-05-20,000001,Vente,156000,6120,,SERVIERE,B057,07120,07023,Balazuc,07,,,070230000A0623,,,,,,,,,,,,,0,1,Maison,45,1,S,sols,,,240,4.379699,44.512151
2020-80239,2020-06-08,000001,Vente,15000,,,CHAMP VACHERET,B009,07120,07023,Balazuc,07,,,070230000C0911,,,,,,,,,,,,,0,,,,,BT,taillis simples,,,8100,4.363902,44.496133
2020-80239,2020-06-08,000001,Vente,15000,,,CHAMP VACHERET,B009,07120,07023,Balazuc,07,,,070230000C0920,,,,,,,,,,,,,0,,,,,BT,taillis simples,,,1700,4.362651,44.497198
2020-80239,2020-06-08,000001,Vente,15000,,,CHAMP VACHERET,B009,07120,07023,Balazuc,07,,,070230000C0921,,,,,,,,,,,,,0,,,,,L,landes,,,21000,4.363658,44.498129
2020-80239,2020-06-08,000001,Vente,15000,,,CHAMP VACHERET,B009,07120,07023,Balazuc,07,,,070230000C1711,,,,,,,,,,,,,0,,,,,BT,taillis simples,,,5640,4.362619,44.496062
2020-80285,2020-06-30,000001,Vente,105587.1,,,SERVIERE,B057,07120,07023,Balazuc,07,,,070230000A0621,,,,,,,,,,,,,0,,,,,AB,terrains a bâtir,,,180,4.379266,44.512407
2020-80285,2020-06-30,000001,Vente,105587.1,,,SERVIERE,B057,07120,07023,Balazuc,07,,,070230000A0622,,,,,,,,,,,,,0,,,,,AB,terrains a bâtir,,,2200,,
2020-80827,2020-07-09,000001,Vente,170700,,,SERRE MERLAS,B056,07120,07023,Balazuc,07,,,070230000D0619,,,,,,,,,,,,,0,,,,,T,terres,,,880,4.382482,44.500157
2020-80827,2020-07-09,000001,Vente,170700,,,SERRE MERLAS,B056,07120,07023,Balazuc,07,,,070230000D0620,,,,,,,,,,,,,0,,,,,L,landes,,,570,4.382198,44.500101
2020-80827,2020-07-09,000001,Vente,170700,893,,CHE DE SERRE MERLAS,0100,07120,07023,Balazuc,07,,,070230000D1262,,,,,,,,,,,,,0,1,Maison,59,3,S,sols,,,1200,4.381649,44.500046
2020-80968,2020-08-06,000001,Vente,250000,5096,,LE VILLAGE,B062,07120,07023,Balazuc,07,,,070230000C0729,,,,,,,,,,,,,0,4,Local industriel. commercial ou assimilé,120,0,S,sols,,,480,4.371782,44.508672
2020-80968,2020-08-06,000001,Vente,250000,5096,,LE VILLAGE,B062,07120,07023,Balazuc,07,,,070230000C0729,,,,,,,,,,,,,0,1,Maison,60,3,S,sols,,,480,4.371782,44.508672
2020-81138,2020-08-24,000001,Vente,2500,,,LES COMBES,B023,07120,07023,Balazuc,07,,,070230000B0197,,,,,,,,,,,,,0,,,,,BT,taillis simples,,,400,4.358918,44.511725
2020-81138,2020-08-24,000001,Vente,2500,,,LES COMBES,B023,07120,07023,Balazuc,07,,,070230000B0198,,,,,,,,,,,,,0,,,,,BT,taillis simples,,,1970,4.359106,44.511658
2020-81138,2020-08-24,000001,Vente,2500,,,PLAGNES,B044,07120,07023,Balazuc,07,,,070230000D0351,,,,,,,,,,,,,0,,,,,VI,vignes,,,2200,4.388903,44.50239
2020-81138,2020-08-24,000001,Vente,2500,,,PLAGNES,B044,07120,07023,Balazuc,07,,,070230000D0359,,,,,,,,,,,,,0,,,,,VI,vignes,,,920,4.388309,44.502166
2020-81138,2020-08-24,000001,Vente,2500,,,LES COSTES,B026,07120,07023,Balazuc,07,,,070230000D0884,,,,,,,,,,,,,0,,,,,L,landes,,,2480,4.402643,44.495707
2020-81365,2020-08-27,000002,Echange,1582,,,LES BARASSES,B002,07120,07023,Balazuc,07,,,070230000A0393,,,,,,,,,,,,,0,,,,,T,terres,,,475,4.372828,44.512685
2020-81365,2020-08-27,000002,Echange,1582,,,LES BARASSES,B002,07120,07023,Balazuc,07,,,070230000A0740,,,,,,,,,,,,,0,,,,,T,terres,,,21,4.373013,44.512728
2020-81365,2020-08-27,000002,Echange,1582,,,LES BARASSES,B002,07120,07023,Balazuc,07,,,070230000A0742,,,,,,,,,,,,,0,,,,,T,terres,,,1086,4.373523,44.512711
2020-81366,2020-08-27,000003,Echange,413,,,LES BARASSES,B002,07120,07023,Balazuc,07,,,070230000A0744,,,,,,,,,,,,,0,,,,,L,landes,,,413,4.373775,44.512899
2020-81394,2020-08-24,000001,Vente,1500,,,LE COMMUNAL,B024,07120,07023,Balazuc,07,,,070230000A0165,,,,,,,,,,,,,0,,,,,L,landes,,,2500,4.363322,44.530199
2020-81394,2020-08-24,000001,Vente,1500,,,LE COMMUNAL,B024,07120,07023,Balazuc,07,,,070230000A0188,,,,,,,,,,,,,0,,,,,L,landes,,,1000,4.361705,44.528633
2020-81394,2020-08-24,000001,Vente,1500,,,LE COMMUNAL,B024,07120,07023,Balazuc,07,,,070230000A0231,,,,,,,,,,,,,0,,,,,L,landes,,,2600,4.364881,44.531657
2020-81394,2020-08-24,000001,Vente,1500,,,VIGIERS,B061,07120,07023,Balazuc,07,,,070230000B0241,,,,,,,,,,,,,0,,,,,L,landes,,,4250,4.359064,44.510426
2020-81394,2020-08-24,000001,Vente,1500,,,VIGIERS,B061,07120,07023,Balazuc,07,,,070230000B0242,,,,,,,,,,,,,0,,,,,BT,taillis simples,,,1920,4.359391,44.510459
2020-81394,2020-08-24,000001,Vente,1500,,,SERRE LA BERRE,B055,07120,07023,Balazuc,07,,,070230000C0293,,,,,,,,,,,,,0,,,,,T,terres,,,570,4.376279,44.49992
2020-81394,2020-08-24,000001,Vente,1500,,,SERRE LA BERRE,B055,07120,07023,Balazuc,07,,,070230000C0294,,,,,,,,,,,,,0,,,,,T,terres,,,670,4.376748,44.500046
2020-81396,2020-09-11,000001,Vente,11000,,,SERVIERE,B057,07120,07023,Balazuc,07,,,070230000A0698,,,,,,,,,,,,,0,,,,,L,landes,,,2134,4.37511,44.512197
2020-81651,2020-09-30,000001,Vente,182000,5539,,CHAZOTTE,B018,07120,07023,Balazuc,07,,,070230000D1026,,,,,,,,,,,,,0,1,Maison,79,3,S,sols,,,1093,4.380065,44.504583
2020-81651,2020-09-30,000001,Vente,182000,,,CHAZOTTE,B018,07120,07023,Balazuc,07,,,070230000D1233,,,,,,,,,,,,,0,,,,,L,landes,,,497,4.380185,44.504378
2020-81651,2020-09-30,000001,Vente,182000,,,L EXTRADE,B030,07120,07023,Balazuc,07,,,070230000D1239,,,,,,,,,,,,,0,,,,,L,landes,,,501,4.380555,44.504255
2020-82489,2020-11-17,000001,Vente,90000,,,COUSAMAS,B027,07120,07023,Balazuc,07,,,070230000D0506,,,2,40.85,,,,,,,,,1,1,Maison,53,2,,,,,,4.382333,44.488085
2020-82489,2020-11-17,000001,Vente,90000,235,,IMP DE COUSAMAS,0044,07120,07023,Balazuc,07,,,070230000D1323,,,,,,,,,,,,,0,1,Maison,60,2,S,sols,,,507,4.382138,44.488319
2020-82589,2020-11-30,000001,Vente,349000,,,COUSAMAS,B027,07120,07023,Balazuc,07,,,070230000D0492,,,,,,,,,,,,,0,,,,,L,landes,,,660,4.382549,44.490975
2020-82589,2020-11-30,000001,Vente,349000,1511,,RTE DE PRADONS,0208,07120,07023,Balazuc,07,,,070230000D1030,,,,,,,,,,,,,0,1,Maison,93,4,S,sols,,,5892,4.383061,44.491917
2020-82589,2020-11-30,000001,Vente,349000,1511,,RTE DE PRADONS,0208,07120,07023,Balazuc,07,,,070230000D1030,,,,,,,,,,,,,0,1,Maison,93,4,L,landes,,,10732,4.383061,44.491917
2020-82589,2020-11-30,000001,Vente,349000,,,SERRE BARBAUD,B051,07120,07023,Balazuc,07,,,070230000D1071,,,,,,,,,,,,,0,,,,,L,landes,,,7769,4.382296,44.492186
2020-82589,2020-11-30,000001,Vente,349000,,,SERRE BARBAUD,B051,07120,07023,Balazuc,07,,,070230000D1071,,,,,,,,,,,,,0,,,,,S,sols,,,500,4.382296,44.492186
2020-82768,2020-12-03,000001,Vente,100000,1200,,CHE DE CHAUSSY,0042,07120,07023,Balazuc,07,,,070230000D1006,,,,,,,,,,,,,0,1,Maison,45,3,S,sols,,,1000,4.400183,44.507276
2020-83235,2020-12-31,000001,Vente,200000,905,,RTE DE SAINT MAURICE,0211,07120,07023,Balazuc,07,,,070230000C1501,,,1,,3,,5,,,,,,3,3,Dépendance,,0,,,,,,4.38583,44.510707
2020-83235,2020-12-31,000001,Vente,200000,905,,RTE DE SAINT MAURICE,0211,07120,07023,Balazuc,07,,,070230000C1501,,,2,,4,,6,,,,,,3,1,Maison,113,3,,,,,,4.38583,44.510707
2020-83235,2020-12-31,000001,Vente,200000,905,,RTE DE SAINT MAURICE,0211,07120,07023,Balazuc,07,,,070230000C1501,,,1,,3,,5,,,,,,3,1,Maison,113,3,,,,,,4.38583,44.510707
2020-83235,2020-12-31,000001,Vente,200000,,,LES SALLES,B049,07120,07023,Balazuc,07,,,070230000C1719,,,,,,,,,,,,,0,,,,,VE,vergers,,,1179,4.386353,44.510673
