id_mutation,date_mutation,numero_disposition,nature_mutation,valeur_fonciere,adresse_numero,adresse_suffixe,adresse_nom_voie,adresse_code_voie,code_postal,code_commune,nom_commune,code_departement,ancien_code_commune,ancien_nom_commune,id_parcelle,ancien_id_parcelle,numero_volume,lot1_numero,lot1_surface_carrez,lot2_numero,lot2_surface_carrez,lot3_numero,lot3_surface_carrez,lot4_numero,lot4_surface_carrez,lot5_numero,lot5_surface_carrez,nombre_lots,code_type_local,type_local,surface_reelle_bati,nombre_pieces_principales,code_nature_culture,nature_culture,code_nature_culture_speciale,nature_culture_speciale,surface_terrain,longitude,latitude
2020-83347,2020-01-18,000001,Vente,198500,,,LES RIBES,B085,07310,07037,Borée,07,,,070370000H0396,,,,,,,,,,,,,0,,,,,P,prés,,,1070,4.22525,44.902643
2020-83347,2020-01-18,000001,Vente,198500,,,LES RIBES,B085,07310,07037,Borée,07,,,070370000H0400,,,,,,,,,,,,,0,,,,,L,landes,,,1717,4.226973,44.902081
2020-83347,2020-01-18,000001,Vente,198500,,,LES RIBES,B085,07310,07037,Borée,07,,,070370000H0401,,,,,,,,,,,,,0,,,,,P,prés,,,5740,4.226249,44.902395
2020-83347,2020-01-18,000001,Vente,198500,,,LES RIBES,B085,07310,07037,Borée,07,,,070370000H0412,,,,,,,,,,,,,0,,,,,P,prés,,,1480,4.223999,44.90198
2020-83347,2020-01-18,000001,Vente,198500,,,LES RIBES,B085,07310,07037,Borée,07,,,070370000H0417,,,,,,,,,,,,,0,,,,,P,prés,,,865,4.224069,44.902747
2020-83347,2020-01-18,000001,Vente,198500,5175,,LES RIBES,B085,07310,07037,Borée,07,,,070370000H0419,,,,,,,,,,,,,0,1,Maison,85,3,S,sols,,,670,4.223841,44.902511
2020-83347,2020-01-18,000001,Vente,198500,,,LES RIBES,B085,07310,07037,Borée,07,,,070370000H0425,,,,,,,,,,,,,0,,,,,T,terres,,,483,4.223384,44.902324
2020-83347,2020-01-18,000001,Vente,198500,,,LES RIBES,B085,07310,07037,Borée,07,,,070370000H0518,,,,,,,,,,,,,0,,,,,P,prés,,,353,4.223574,44.902218
2020-83585,2020-02-15,000001,Vente,10000,,,LES HERGNES,B054,07310,07037,Borée,07,,,070370000G0041,,,,,,,,,,,,,0,,,,,L,landes,,,4985,4.20013,44.89706
2020-83585,2020-02-15,000001,Vente,10000,,,GAMDOULET,B045,07310,07037,Borée,07,,,070370000H0003,,,,,,,,,,,,,0,,,,,PA,pâtures,PATUR,Pâture plantée,72880,4.200989,44.906221
2020-83585,2020-02-15,000001,Vente,10000,,,GAMDOULET,B045,07310,07037,Borée,07,,,070370000H0004,,,,,,,,,,,,,0,,,,,S,sols,,,187,4.199987,44.905786
2020-83585,2020-02-15,000001,Vente,10000,,,LE CROS,B031,07310,07037,Borée,07,,,070370000H0012,,,,,,,,,,,,,0,,,,,PA,pâtures,PATUR,Pâture plantée,2061,4.20073,44.901519
2020-83585,2020-02-15,000001,Vente,10000,,,LE CROS,B031,07310,07037,Borée,07,,,070370000H0035,,,,,,,,,,,,,0,,,,,P,prés,,,3760,4.195654,44.899537
2020-83585,2020-02-15,000001,Vente,10000,,,LACHAMP DE RAFFET,B058,07310,07037,Borée,07,,,070370000H0468,,,,,,,,,,,,,0,,,,,PA,pâtures,PATUR,Pâture plantée,29233,4.201856,44.905772
2020-83585,2020-02-15,000001,Vente,10000,,,LACHAMP DE RAFFET,B058,07310,07037,Borée,07,,,070370000H0471,,,,,,,,,,,,,0,,,,,PA,pâtures,PATUR,Pâture plantée,6678,4.203572,44.907229
2020-83585,2020-02-15,000001,Vente,10000,,,LACHAMP DE RAFFET,B058,07310,07037,Borée,07,,,070370000H0472,,,,,,,,,,,,,0,,,,,PA,pâtures,PATUR,Pâture plantée,7983,4.203056,44.90802
2020-83853,2020-02-17,000001,Vente,114000,5131,,PREVENCHERE,B082,07310,07037,Borée,07,,,070370000E0674,,,,,,,,,,,,,0,1,Maison,92,3,S,sols,,,135,4.230181,44.890036
2020-83853,2020-02-17,000001,Vente,114000,,,PREVENCHERE,B082,07310,07037,Borée,07,,,070370000E1054,,,,,,,,,,,,,0,,,,,P,prés,,,267,4.230146,44.890138
2020-83853,2020-02-17,000001,Vente,114000,,,PREVENCHERE,B082,07310,07037,Borée,07,,,070370000E1055,,,,,,,,,,,,,0,,,,,P,prés,,,1,4.230282,44.890185
2020-83853,2020-02-17,000001,Vente,114000,,,PREVENCHERE,B082,07310,07037,Borée,07,,,070370000E1057,,,,,,,,,,,,,0,,,,,T,terres,,,165,4.230368,44.889893
2020-84359,2020-06-12,000002,Vente,50000,5243,,PREVENCHERE,B082,07310,07037,Borée,07,,,070370000E1188,,,,,,,,,,,,,0,1,Maison,66,2,P,prés,,,3819,4.228047,44.890387
2020-84531,2020-06-12,000001,Vente,80000,,,LE CLAUX,B025,07310,07037,Borée,07,,,070370000H0359,,,,,,,,,,,,,0,,,,,L,landes,,,1635,4.226569,44.904736
2020-84531,2020-06-12,000001,Vente,80000,,,LES RIBES,B085,07310,07037,Borée,07,,,070370000H0381,,,,,,,,,,,,,0,,,,,L,landes,,,524,4.225964,44.904045
2020-84531,2020-06-12,000001,Vente,80000,,,LES RIBES,B085,07310,07037,Borée,07,,,070370000H0382,,,,,,,,,,,,,0,,,,,L,landes,,,160,4.2265,44.904522
2020-84531,2020-06-12,000001,Vente,80000,,,LES RIBES,B085,07310,07037,Borée,07,,,070370000H0394,,,,,,,,,,,,,0,,,,,P,prés,,,1145,4.224557,44.903096
2020-84531,2020-06-12,000001,Vente,80000,,,LES RIBES,B085,07310,07037,Borée,07,,,070370000H0397,,,,,,,,,,,,,0,,,,,P,prés,,,510,4.225286,44.902957
2020-84531,2020-06-12,000001,Vente,80000,5174,,LES RIBES,B085,07310,07037,Borée,07,,,070370000H0418,,,,,,,,,,,,,0,1,Maison,60,2,S,sols,,,902,4.224063,44.902446
2020-85131,2020-08-07,000001,Vente,46000,5021,,ECHAMPS,B035,07310,07037,Borée,07,,,070370000C0165,,,,,,,,,,,,,0,1,Maison,38,3,S,sols,,,212,4.261455,44.902879
2020-85131,2020-08-07,000001,Vente,46000,,,ECHAMPS,B035,07310,07037,Borée,07,,,070370000C0168,,,,,,,,,,,,,0,,,,,T,terres,,,667,4.261715,44.902952
2020-85294,2020-09-09,000001,Vente,1500,,,SOUS PIALOUX,B094,07310,07037,Borée,07,,,070370000C0200,,,,,,,,,,,,,0,,,,,T,terres,,,1554,4.258773,44.901911
2020-85294,2020-09-09,000001,Vente,1500,,,SOUS PIALOUX,B094,07310,07037,Borée,07,,,070370000C0201,,,,,,,,,,,,,0,,,,,P,prés,,,2541,4.258679,44.902362
2020-85619,2020-10-08,000001,Vente,75000,,,LES TRAVERSIERS,B099,07310,07037,Borée,07,,,070370000E0427,,,,,,,,,,,,,0,,,,,P,prés,,,4683,4.228825,44.8939
2020-85619,2020-10-08,000001,Vente,75000,5133,,PREVENCHERE,B082,07310,07037,Borée,07,,,070370000E0680,,,,,,,,,,,,,0,1,Maison,60,2,S,sols,,,1687,4.229875,44.889525
2020-85619,2020-10-08,000001,Vente,75000,,,PREVENCHERE,B082,07310,07037,Borée,07,,,070370000E0686,,,,,,,,,,,,,0,,,,,S,sols,,,790,4.230539,44.888908
2020-85619,2020-10-08,000001,Vente,75000,,,PREVENCHERE,B082,07310,07037,Borée,07,,,070370000E0697,,,,,,,,,,,,,0,,,,,T,terres,,,3642,4.230455,44.888321
2020-85619,2020-10-08,000001,Vente,75000,,,PREVENCHERE,B082,07310,07037,Borée,07,,,070370000E0701,,,,,,,,,,,,,0,,,,,P,prés,,,3767,4.228998,44.888296
2020-85619,2020-10-08,000001,Vente,75000,,,PREVENCHERE,B082,07310,07037,Borée,07,,,070370000E0709,,,,,,,,,,,,,0,,,,,T,terres,,,1092,4.229466,44.888713
2020-85619,2020-10-08,000001,Vente,75000,,,LA GIROUANE ET CLOS CHAUD,B050,07310,07037,Borée,07,,,070370000E0764,,,,,,,,,,,,,0,,,,,P,prés,,,2180,4.229687,44.887422
2020-85619,2020-10-08,000001,Vente,75000,,,LA GIROUANE ET CLOS CHAUD,B050,07310,07037,Borée,07,,,070370000E0768,,,,,,,,,,,,,0,,,,,P,prés,,,5830,4.227177,44.886789
2020-85619,2020-10-08,000001,Vente,75000,,,LA GIROUANE ET CLOS CHAUD,B050,07310,07037,Borée,07,,,070370000E0774,,,,,,,,,,,,,0,,,,,P,prés,,,1361,4.22474,44.885145
2020-85619,2020-10-08,000001,Vente,75000,,,LA GIROUANE ET CLOS CHAUD,B050,07310,07037,Borée,07,,,070370000E0775,,,,,,,,,,,,,0,,,,,L,landes,,,420,4.225154,44.884907
2020-85619,2020-10-08,000001,Vente,75000,,,LA GIROUANE ET CLOS CHAUD,B050,07310,07037,Borée,07,,,070370000E0782,,,,,,,,,,,,,0,,,,,P,prés,,,3240,4.222479,44.88386
2020-85619,2020-10-08,000001,Vente,75000,,,LA GIROUANE ET CLOS CHAUD,B050,07310,07037,Borée,07,,,070370000E0800,,,,,,,,,,,,,0,,,,,T,terres,,,2744,4.222577,44.886438
2020-85619,2020-10-08,000001,Vente,75000,,,PREVENCHERE,B082,07310,07037,Borée,07,,,070370000E1088,,,,,,,,,,,,,0,,,,,T,terres,,,769,4.230176,44.889304
2020-85619,2020-10-08,000001,Vente,75000,,,PREVENCHERE,B082,07310,07037,Borée,07,,,070370000E1094,,,,,,,,,,,,,0,,,,,T,terres,,,211,4.230304,44.889106
2020-85619,2020-10-08,000001,Vente,75000,,,SEIGNEURIAL,B091,07310,07037,Borée,07,,,070370000F0144,,,,,,,,,,,,,0,,,,,BR,futaies résineuses,SAPIN,Sapins ou sapinière,4590,4.225687,44.882577
2020-85619,2020-10-08,000001,Vente,75000,,,PELIGOUX ET COMBE MORTE,B070,07310,07037,Borée,07,,,070370000G0197,,,,,,,,,,,,,0,,,,,BR,futaies résineuses,PIN,Pins,11592,4.210994,44.884323
2020-86513,2020-12-16,000001,Vente,130000,5011,,ECHAMPS,B035,07310,07037,Borée,07,,,070370000C0130,,,,,,,,,,,,,0,1,Maison,30,1,S,sols,,,900,4.256413,44.904402
2020-86513,2020-12-16,000001,Vente,130000,5011,,ECHAMPS,B035,07310,07037,Borée,07,,,070370000C0130,,,,,,,,,,,,,0,3,Dépendance,,0,S,sols,,,900,4.256413,44.904402
2020-86513,2020-12-16,000001,Vente,130000,,,ECHAMPS,B035,07310,07037,Borée,07,,,070370000C0131,,,,,,,,,,,,,0,,,,,T,terres,,,640,4.256715,44.904172
2020-86513,2020-12-16,000001,Vente,130000,,,ECHAMPS,B035,07310,07037,Borée,07,,,070370000C0132,,,,,,,,,,,,,0,,,,,P,prés,,,4980,4.257123,44.904369
2020-86522,2020-12-28,000001,Vente,2000,,,LE FAUX ET L AGREFOUX,B038,07310,07037,Borée,07,,,070370000E0359,,,,,,,,,,,,,0,,,,,T,terres,,,240,4.231277,44.894583
2020-86522,2020-12-28,000001,Vente,2000,,,LE FAUX ET L AGREFOUX,B038,07310,07037,Borée,07,,,070370000E0374,,,,,,,,,,,,,0,,,,,T,terres,,,1940,4.231016,44.894927
2020-86522,2020-12-28,000001,Vente,2000,,,LE FAUX ET L AGREFOUX,B038,07310,07037,Borée,07,,,070370000E0377,,,,,,,,,,,,,0,,,,,P,prés,,,3683,4.231472,44.895322
2020-86522,2020-12-28,000001,Vente,2000,,,LE FAUX ET L AGREFOUX,B038,07310,07037,Borée,07,,,070370000E0377,,,,,,,,,,,,,0,,,,,BR,futaies résineuses,SAPIN,Sapins ou sapinière,3683,4.231472,44.895322
