id_mutation,date_mutation,numero_disposition,nature_mutation,valeur_fonciere,adresse_numero,adresse_suffixe,adresse_nom_voie,adresse_code_voie,code_postal,code_commune,nom_commune,code_departement,ancien_code_commune,ancien_nom_commune,id_parcelle,ancien_id_parcelle,numero_volume,lot1_numero,lot1_surface_carrez,lot2_numero,lot2_surface_carrez,lot3_numero,lot3_surface_carrez,lot4_numero,lot4_surface_carrez,lot5_numero,lot5_surface_carrez,nombre_lots,code_type_local,type_local,surface_reelle_bati,nombre_pieces_principales,code_nature_culture,nature_culture,code_nature_culture_speciale,nature_culture_speciale,surface_terrain,longitude,latitude
2020-79659,2020-05-12,000001,Vente,120000,5030,,MAGEROUAN,B038,07000,07074,Creysseilles,07,,,070740000A0230,,,,,,,,,,,,,0,1,Maison,93,4,S,sols,,,200,4.528491,44.780948
2020-79659,2020-05-12,000001,Vente,120000,,,MAGEROUAN,B038,07000,07074,Creysseilles,07,,,070740000A0909,,,,,,,,,,,,,0,,,,,T,terres,,,230,4.528151,44.780493
2020-79659,2020-05-12,000001,Vente,120000,,,MAGEROUAN,B038,07000,07074,Creysseilles,07,,,070740000A0916,,,,,,,,,,,,,0,,,,,T,terres,,,135,4.528391,44.78076
2020-79930,2020-05-26,000001,Vente terrain à bâtir,36500,,,LE FEMEIL,B023,07000,07074,Creysseilles,07,,,070740000D0552,,,,,,,,,,,,,0,,,,,T,terres,,,771,4.544799,44.750511
2020-80505,2020-07-01,000001,Vente,500,,,LE REY,B053,07000,07074,Creysseilles,07,,,070740000D0321,,,,,,,,,,,,,0,,,,,VI,vignes,,,465,4.544345,44.756097
2020-80895,2020-08-07,000001,Vente,25500,,,MAGEROUAN,B038,07000,07074,Creysseilles,07,,,070740000A0195,,,,,,,,,,,,,0,,,,,T,terres,,,373,4.529454,44.78076
2020-80895,2020-08-07,000001,Vente,25500,5032,,MAGEROUAN,B038,07000,07074,Creysseilles,07,,,070740000A0209,,,,,,,,,,,,,0,1,Maison,56,3,S,sols,,,170,4.529322,44.78059
2020-81458,2020-09-18,000001,Vente,75000,5044,,MAGEROUAN,B038,07000,07074,Creysseilles,07,,,070740000A0202,,,,,,,,,,,,,0,1,Maison,100,4,S,sols,,,240,4.529305,44.780109
2020-81458,2020-09-18,000001,Vente,75000,,,MAGEROUAN,B038,07000,07074,Creysseilles,07,,,070740000A0884,,,,,,,,,,,,,0,,,,,S,sols,,,20,4.529608,44.780048
