id_mutation,date_mutation,numero_disposition,nature_mutation,valeur_fonciere,adresse_numero,adresse_suffixe,adresse_nom_voie,adresse_code_voie,code_postal,code_commune,nom_commune,code_departement,ancien_code_commune,ancien_nom_commune,id_parcelle,ancien_id_parcelle,numero_volume,lot1_numero,lot1_surface_carrez,lot2_numero,lot2_surface_carrez,lot3_numero,lot3_surface_carrez,lot4_numero,lot4_surface_carrez,lot5_numero,lot5_surface_carrez,nombre_lots,code_type_local,type_local,surface_reelle_bati,nombre_pieces_principales,code_nature_culture,nature_culture,code_nature_culture_speciale,nature_culture_speciale,surface_terrain,longitude,latitude
2020-78446,2020-01-13,000001,Vente,15000,,,ROUVET,B030,07120,07183,Pradons,07,,,071830000A0356,,,,,,,,,,,,,0,,,,,BT,taillis simples,,,102188,4.388586,44.474948
2020-78696,2020-02-03,000001,Vente,32000,,,PRADONS,B024,07120,07183,Pradons,07,,,071830000C1334,,,,,,,,,,,,,0,,,,,VE,vergers,,,255,4.35889,44.475875
2020-78696,2020-02-03,000001,Vente,32000,,,PRADONS,B024,07120,07183,Pradons,07,,,071830000C1335,,,,,,,,,,,,,0,,,,,VE,vergers,,,365,4.358723,44.475767
2020-78807,2020-01-20,000001,Vente,9500,,,TRAPPE LOUP,B035,07120,07183,Pradons,07,,,071830000B0166,,,,,,,,,,,,,0,,,,,L,landes,,,10453,4.367987,44.458952
2020-78807,2020-01-20,000001,Vente,9500,,,TRAPPE LOUP,B035,07120,07183,Pradons,07,,,071830000B0168,,,,,,,,,,,,,0,,,,,L,landes,,,19775,4.366166,44.460931
2020-78807,2020-01-20,000001,Vente,9500,,,TRAPPE LOUP,B035,07120,07183,Pradons,07,,,071830000B0168,,,,,,,,,,,,,0,,,,,BT,taillis simples,,,19775,4.366166,44.460931
2020-78972,2020-02-19,000001,Vente,79500,,,CHARDIRIS,B007,07120,07183,Pradons,07,,,071830000C1194,,,,,,,,,,,,,0,,,,,T,terres,,,398,4.351061,44.469565
2020-78972,2020-02-19,000001,Vente,79500,,,CHARDIRIS,B007,07120,07183,Pradons,07,,,071830000C1196,,,,,,,,,,,,,0,,,,,T,terres,,,251,4.351185,44.469804
2020-78972,2020-02-19,000001,Vente,79500,15,B,IMP DE CHARDIRIS,0039,07120,07183,Pradons,07,,,071830000C1198,,,2,,,,,,,,,,1,2,Appartement,46,2,,,,,,4.351692,44.469643
2020-79025,2020-02-27,000001,Vente,180000,,,CHAMP DU SOULIER,B005,07120,07183,Pradons,07,,,071830000C1120,,,,,,,,,,,,,0,,,,,S,sols,,,353,4.356362,44.473595
2020-79025,2020-02-27,000001,Vente,180000,120,,IMP DU CHAMP SOULIER,0036,07120,07183,Pradons,07,,,071830000C1139,,,,,,,,,,,,,0,1,Maison,74,3,J,jardins,,,700,4.355502,44.474068
2020-79025,2020-02-27,000001,Vente,180000,120,,IMP DU CHAMP SOULIER,0036,07120,07183,Pradons,07,,,071830000C1139,,,,,,,,,,,,,0,1,Maison,74,3,S,sols,,,571,4.355502,44.474068
2020-79025,2020-02-27,000001,Vente,180000,,,CHAMP DU SOULIER,B005,07120,07183,Pradons,07,,,071830000C1141,,,,,,,,,,,,,0,,,,,S,sols,,,254,4.355838,44.473795
2020-79151,2020-02-27,000001,Vente,217000,,,RIMBEAU,B027,07120,07183,Pradons,07,,,071830000A0516,,,,,,,,,,,,,0,,,,,S,sols,,,51,4.38092,44.482408
2020-79151,2020-02-27,000001,Vente,217000,,,RIMBEAU,B027,07120,07183,Pradons,07,,,071830000A0518,,,,,,,,,,,,,0,,,,,S,sols,,,66,4.380951,44.482539
2020-79151,2020-02-27,000001,Vente,217000,,,RIMBEAU,B027,07120,07183,Pradons,07,,,071830000A0541,,,,,,,,,,,,,0,,,,,T,terres,,,1693,4.380546,44.482767
2020-79151,2020-02-27,000001,Vente,217000,175,,CHE DES RANCHINS,0088,07120,07183,Pradons,07,,,071830000A0570,,,,,,,,,,,,,0,3,Dépendance,,0,S,sols,,,1000,4.380538,44.482472
2020-79151,2020-02-27,000001,Vente,217000,175,,CHE DES RANCHINS,0088,07120,07183,Pradons,07,,,071830000A0570,,,,,,,,,,,,,0,1,Maison,113,4,T,terres,,,638,4.380538,44.482472
2020-79151,2020-02-27,000001,Vente,217000,175,,CHE DES RANCHINS,0088,07120,07183,Pradons,07,,,071830000A0570,,,,,,,,,,,,,0,3,Dépendance,,0,T,terres,,,638,4.380538,44.482472
2020-79151,2020-02-27,000001,Vente,217000,175,,CHE DES RANCHINS,0088,07120,07183,Pradons,07,,,071830000A0570,,,,,,,,,,,,,0,1,Maison,113,4,S,sols,,,1000,4.380538,44.482472
2020-79499,2020-03-12,000001,Echange,14000,,,LE PLANAS,B023,07120,07183,Pradons,07,,,071830000C0860,,,,,,,,,,,,,0,,,,,L,landes,,,3760,4.365081,44.466157
2020-79533,2020-04-10,000001,Vente,2300,,,ORTIZE,B020,07120,07183,Pradons,07,,,071830000B0044,,,,,,,,,,,,,0,,,,,T,terres,,,1843,4.373535,44.462876
2020-79533,2020-04-10,000001,Vente,2300,,,ORTIZE,B020,07120,07183,Pradons,07,,,071830000B0044,,,,,,,,,,,,,0,,,,,L,landes,,,4407,4.373535,44.462876
2020-79534,2020-04-10,000001,Vente,7500,,,LES ROUTTES,B029,07120,07183,Pradons,07,,,071830000B0027,,,,,,,,,,,,,0,,,,,VI,vignes,,,6690,4.370572,44.463164
2020-79769,2020-05-22,000001,Vente,114500,,,CHARDIRIS,B007,07120,07183,Pradons,07,,,071830000C1194,,,,,,,,,,,,,0,,,,,T,terres,,,398,4.351061,44.469565
2020-79769,2020-05-22,000001,Vente,114500,,,CHARDIRIS,B007,07120,07183,Pradons,07,,,071830000C1196,,,,,,,,,,,,,0,,,,,T,terres,,,251,4.351185,44.469804
2020-79769,2020-05-22,000001,Vente,114500,15,B,IMP DE CHARDIRIS,0039,07120,07183,Pradons,07,,,071830000C1198,,,4,,,,,,,,,,1,2,Appartement,87,4,,,,,,4.351692,44.469643
2020-79778,2020-05-15,000001,Vente,112000,,,CHARDIRIS,B007,07120,07183,Pradons,07,,,071830000C1194,,,,,,,,,,,,,0,,,,,T,terres,,,398,4.351061,44.469565
2020-79778,2020-05-15,000001,Vente,112000,,,CHARDIRIS,B007,07120,07183,Pradons,07,,,071830000C1196,,,,,,,,,,,,,0,,,,,T,terres,,,251,4.351185,44.469804
2020-79778,2020-05-15,000001,Vente,112000,15,B,IMP DE CHARDIRIS,0039,07120,07183,Pradons,07,,,071830000C1198,,,3,,,,,,,,,,1,2,Appartement,77,3,,,,,,4.351692,44.469643
2020-79789,2020-05-11,000001,Vente,120000,1695,,RTE DE RUOMS,0009,07120,07183,Pradons,07,,,071830000A0559,,,,,,,,,,,,,0,1,Maison,69,4,S,sols,,,1300,4.36852,44.476284
2020-79789,2020-05-11,000001,Vente,120000,1695,,RTE DE RUOMS,0009,07120,07183,Pradons,07,,,071830000A0559,,,,,,,,,,,,,0,1,Maison,69,4,J,jardins,,,1275,4.36852,44.476284
2020-79838,2020-05-07,000001,Vente,180000,220,,CHE DES GRANGES,0082,07120,07183,Pradons,07,,,071830000C0325,,,,,,,,,,,,,0,3,Dépendance,,0,S,sols,,,1260,4.360186,44.472622
2020-79838,2020-05-07,000001,Vente,180000,220,,CHE DES GRANGES,0082,07120,07183,Pradons,07,,,071830000C0325,,,,,,,,,,,,,0,1,Maison,75,4,J,jardins,,,1375,4.360186,44.472622
2020-79838,2020-05-07,000001,Vente,180000,220,,CHE DES GRANGES,0082,07120,07183,Pradons,07,,,071830000C0325,,,,,,,,,,,,,0,3,Dépendance,,0,J,jardins,,,1375,4.360186,44.472622
2020-79838,2020-05-07,000001,Vente,180000,220,,CHE DES GRANGES,0082,07120,07183,Pradons,07,,,071830000C0325,,,,,,,,,,,,,0,1,Maison,75,4,S,sols,,,1260,4.360186,44.472622
2020-79948,2020-06-02,000001,Vente,74000,,,CHARDIRIS,B007,07120,07183,Pradons,07,,,071830000C0522,,,,,,,,,,,,,0,,,,,T,terres,,,350,4.356058,44.470314
2020-79948,2020-06-02,000001,Vente,74000,,,CHARDIRIS,B007,07120,07183,Pradons,07,,,071830000C1596,,,,,,,,,,,,,0,,,,,T,terres,,,1055,4.356128,44.470601
2020-80440,2020-07-06,000001,Vente,1800,,,RANLE,B025,07120,07183,Pradons,07,,,071830000B0208,,,,,,,,,,,,,0,,,,,VI,vignes,,,1728,4.36398,44.463722
2020-80931,2020-07-31,000001,Vente,203600,5669,,COUSTACE,B012,07120,07183,Pradons,07,,,071830000C1339,,,,,,,,,,,,,0,1,Maison,101,3,S,sols,,,1604,4.361999,44.476003
2020-80931,2020-07-31,000001,Vente,203600,,,COUSTACE,B012,07120,07183,Pradons,07,,,071830000C1341,,,,,,,,,,,,,0,,,,,S,sols,,,37,4.362417,44.475873
2020-80958,2020-07-29,000001,Vente,280000,5791,,REYNARDE,B026,07120,07183,Pradons,07,,,071830000C1565,,,,,,,,,,,,,0,1,Maison,107,4,S,sols,,,1159,4.364398,44.476053
2020-81611,2020-10-05,000001,Vente,335300,65,,CHE DE MONTSELGUES,0055,07120,07183,Pradons,07,,,071830000C0451,,,,,,,,,,,,,0,1,Maison,146,5,S,sols,,,680,4.357267,44.471611
2020-81611,2020-10-05,000001,Vente,335300,,,LES BLACHES,B003,07120,07183,Pradons,07,,,071830000C1343,,,,,,,,,,,,,0,,,,,S,sols,,,679,4.357044,44.471565
2020-81611,2020-10-05,000001,Vente,335300,,,LES BLACHES,B003,07120,07183,Pradons,07,,,071830000C1350,,,,,,,,,,,,,0,,,,,S,sols,,,64,4.356746,44.471642
2020-81663,2020-09-07,000002,Vente,160000,,,LES GRANGES,B016,07120,07183,Pradons,07,,,071830000C0336,,,,,,,,,,,,,0,,,,,S,sols,,,482,4.362188,44.473336
2020-81663,2020-09-07,000002,Vente,160000,,,LES GRANGES,B016,07120,07183,Pradons,07,,,071830000C0897,,,,,,,,,,,,,0,,,,,T,terres,,,372,4.362472,44.472982
2020-81663,2020-09-07,000002,Vente,160000,,,LES GRANGES,B016,07120,07183,Pradons,07,,,071830000C0913,,,,,,,,,,,,,0,,,,,S,sols,,,55,4.362224,44.473021
2020-81663,2020-09-07,000002,Vente,160000,,,LES GRANGES,B016,07120,07183,Pradons,07,,,071830000C0919,,,,,,,,,,,,,0,,,,,S,sols,,,31,4.36203,44.473102
2020-81663,2020-09-07,000002,Vente,160000,,,LES GRANGES,B016,07120,07183,Pradons,07,,,071830000C0931,,,,,,,,,,,,,0,,,,,P,prés,,,25,4.362406,44.473411
2020-81663,2020-09-07,000002,Vente,160000,5059,,LES GRANGES,B016,07120,07183,Pradons,07,,,071830000C1423,,,,,,,,,,,,,0,,,,,S,sols,,,1582,4.362295,44.473121
2020-81715,2020-09-18,000001,Vente,295000,,,CHAMP DU SOULIER,B005,07120,07183,Pradons,07,,,071830000C1468,,,,,,,,,,,,,0,,,,,AB,terrains a bâtir,,,43,4.356183,44.473189
2020-81715,2020-09-18,000001,Vente,295000,,,CHAMP DU SOULIER,B005,07120,07183,Pradons,07,,,071830000C1469,,,,,,,,,,,,,0,,,,,AB,terrains a bâtir,,,54,4.356324,44.473126
2020-81715,2020-09-18,000001,Vente,295000,,,CHAMP DU SOULIER,B005,07120,07183,Pradons,07,,,071830000C1470,,,,,,,,,,,,,0,,,,,T,terres,,,50,4.35624,44.473216
2020-81715,2020-09-18,000001,Vente,295000,,,CHAMP DU SOULIER,B005,07120,07183,Pradons,07,,,071830000C1471,,,,,,,,,,,,,0,,,,,S,sols,,,85,4.35638,44.473161
2020-81715,2020-09-18,000001,Vente,295000,,,CHAMP DU SOULIER,B005,07120,07183,Pradons,07,,,071830000C1472,,,,,,,,,,,,,0,,,,,J,jardins,,,15,4.355756,44.473023
2020-81715,2020-09-18,000001,Vente,295000,2790,,RTE DE RUOMS,0009,07120,07183,Pradons,07,,,071830000C1474,,,,,,,,,,,,,0,1,Maison,185,4,S,sols,,,835,4.355896,44.473175
2020-82197,2020-11-14,000001,Vente,116500,25,,RUE DE L'ECOLE,0047,07120,07183,Pradons,07,,,071830000C0791,,,,,,,,,,,,,0,,,,,S,sols,,,20,4.357956,44.475237
2020-82197,2020-11-14,000001,Vente,116500,5046,,PRADONS,B024,07120,07183,Pradons,07,,,071830000C0800,,,,,,,,,,,,,0,1,Maison,55,2,S,sols,,,20,4.357975,44.475283
2020-82197,2020-11-14,000001,Vente,116500,,,PRADONS,B024,07120,07183,Pradons,07,,,071830000C0805,,,,,,,,,,,,,0,,,,,T,terres,,,490,4.358859,44.475337
2020-82352,2020-11-10,000001,Vente,160000,210,A,CHE DE LA REYNARDE,0097,07120,07183,Pradons,07,,,071830000C1399,,,,,,,,,,,,,0,,,,,AB,terrains a bâtir,,,2000,4.364328,44.473997
2020-82352,2020-11-10,000001,Vente,160000,210,A,CHE DE LA REYNARDE,0097,07120,07183,Pradons,07,,,071830000C1399,,,,,,,,,,,,,0,,,,,L,landes,,,1040,4.364328,44.473997
2020-82486,2020-11-27,000001,Vente,219900,,,CHAMP DU SOULIER,B005,07120,07183,Pradons,07,,,071830000C0604,,,,,,,,,,,,,0,,,,,S,sols,,,123,4.357068,44.473317
2020-82486,2020-11-27,000001,Vente,219900,5009,,CHAMP DU SOULIER,B005,07120,07183,Pradons,07,,,071830000C0864,,,,,,,,,,,,,0,1,Maison,100,3,S,sols,,,97,4.357163,44.473401
2020-82486,2020-11-27,000001,Vente,219900,2755,,RTE DE RUOMS,0009,07120,07183,Pradons,07,,,071830000C0991,,,,,,,,,,,,,0,,,,,T,terres,,,569,4.357018,44.473176
2020-82856,2020-12-09,000001,Vente,40000,,,LE PLANAS,B023,07120,07183,Pradons,07,,,071830000C0860,,,,,,,,,,,,,0,,,,,L,landes,,,3760,4.365081,44.466157
2020-83070,2020-12-22,000001,Vente,135000,20,,IMP DES TROIS PONTS,0077,07120,07183,Pradons,07,,,071830000C0918,,,,,,,,,,,,,0,1,Maison,120,5,S,sols,,,78,4.357689,44.474594
2020-83245,2020-12-30,000002,Vente,1467,,,LES BLACHES,B003,07120,07183,Pradons,07,,,071830000C0933,,,,,,,,,,,,,0,,,,,S,sols,,,569,4.356442,44.472095
2020-83245,2020-12-30,000002,Vente,1467,,,LES GRANGES,B016,07120,07183,Pradons,07,,,071830000C1622,,,,,,,,,,,,,0,,,,,S,sols,,,106,4.360079,44.473455
2020-83245,2020-12-30,000002,Vente,1467,,,LES GRANGES,B016,07120,07183,Pradons,07,,,071830000C1623,,,,,,,,,,,,,0,,,,,S,sols,,,104,4.358808,44.473056
2020-83245,2020-12-30,000002,Vente,1467,,,LES BLACHES,B003,07120,07183,Pradons,07,,,071830000C1625,,,,,,,,,,,,,0,,,,,L,landes,,,688,4.357816,44.472624
