id_mutation,date_mutation,numero_disposition,nature_mutation,valeur_fonciere,adresse_numero,adresse_suffixe,adresse_nom_voie,adresse_code_voie,code_postal,code_commune,nom_commune,code_departement,ancien_code_commune,ancien_nom_commune,id_parcelle,ancien_id_parcelle,numero_volume,lot1_numero,lot1_surface_carrez,lot2_numero,lot2_surface_carrez,lot3_numero,lot3_surface_carrez,lot4_numero,lot4_surface_carrez,lot5_numero,lot5_surface_carrez,nombre_lots,code_type_local,type_local,surface_reelle_bati,nombre_pieces_principales,code_nature_culture,nature_culture,code_nature_culture_speciale,nature_culture_speciale,surface_terrain,longitude,latitude
2020-83726,2020-02-21,000001,Vente,5000,,,LE VERNAT,B049,07240,07214,Saint-Apollinaire-de-Rias,07,,,07214000AC0083,,,,,,,,,,,,,0,,,,,P,prés,,,30595,4.609212,44.897451
2020-84129,2020-05-13,000002,Vente,626,,,ECHIOL,B023,07240,07214,Saint-Apollinaire-de-Rias,07,,,07214000AC0285,,,,,,,,,,,,,0,,,,,BR,futaies résineuses,PIN,Pins,1563,4.607034,44.90649
2020-84165,2020-04-30,000002,Vente,30000,,,LES CHARIVES,B013,07240,07214,Saint-Apollinaire-de-Rias,07,,,072140000A0641,,,,,,,,,,,,,0,,,,,T,terres,,,381,4.595859,44.917765
2020-84165,2020-04-30,000002,Vente,30000,,,LES CHARIVES,B013,07240,07214,Saint-Apollinaire-de-Rias,07,,,072140000A0839,,,,,,,,,,,,,0,,,,,BT,taillis simples,,,3699,4.595817,44.917708
2020-84353,2020-05-27,000001,Vente,3000,,,LA TAILLA,B047,07240,07214,Saint-Apollinaire-de-Rias,07,,,072140000B0040,,,,,,,,,,,,,0,,,,,BR,futaies résineuses,PIN,Pins,11910,4.575293,44.926745
2020-84362,2020-05-18,000001,Vente,1500,,,JURUSSON,B030,07240,07214,Saint-Apollinaire-de-Rias,07,,,072140000A0342,,,,,,,,,,,,,0,,,,,BR,futaies résineuses,PIN,Pins,900,4.601315,44.921189
2020-84362,2020-05-18,000001,Vente,1500,,,JURUSSON,B030,07240,07214,Saint-Apollinaire-de-Rias,07,,,072140000A0343,,,,,,,,,,,,,0,,,,,BT,taillis simples,,,3740,4.600468,44.921447
2020-84362,2020-05-18,000001,Vente,1500,,,LES CHARIVES,B013,07240,07214,Saint-Apollinaire-de-Rias,07,,,072140000A0421,,,,,,,,,,,,,0,,,,,L,landes,,,930,4.594853,44.917329
2020-84362,2020-05-18,000001,Vente,1500,,,LES CHARIVES,B013,07240,07214,Saint-Apollinaire-de-Rias,07,,,072140000A0422,,,,,,,,,,,,,0,,,,,T,terres,,,1120,4.595917,44.917196
2020-84362,2020-05-18,000001,Vente,1500,,,LES CHARIVES,B013,07240,07214,Saint-Apollinaire-de-Rias,07,,,072140000A0795,,,,,,,,,,,,,0,,,,,BT,taillis simples,,,2226,4.596011,44.916912
2020-84362,2020-05-18,000001,Vente,1500,,,LES CHARIVES,B013,07240,07214,Saint-Apollinaire-de-Rias,07,,,072140000A0840,,,,,,,,,,,,,0,,,,,BT,taillis simples,,,3113,4.59636,44.917118
2020-84376,2020-05-29,000001,Vente,152700,,,LE VILLAGE,B051,07240,07214,Saint-Apollinaire-de-Rias,07,,,072140000A0169,,,,,,,,,,,,,0,,,,,L,landes,,,20,4.597541,44.926346
2020-84376,2020-05-29,000001,Vente,152700,,,LE VILLAGE,B051,07240,07214,Saint-Apollinaire-de-Rias,07,,,072140000A0192,,,,,,,,,,,,,0,,,,,S,sols,,,36,4.598927,44.925361
2020-84376,2020-05-29,000001,Vente,152700,,,LE VILLAGE,B051,07240,07214,Saint-Apollinaire-de-Rias,07,,,072140000A0226,,,,,,,,,,,,,0,,,,,J,jardins,,,120,4.598586,44.925282
2020-84376,2020-05-29,000001,Vente,152700,5054,,LE VILLAGE,B051,07240,07214,Saint-Apollinaire-de-Rias,07,,,072140000A0591,,,,,,,,,,,,,0,1,Maison,80,3,S,sols,,,42,4.598745,44.925376
2020-84376,2020-05-29,000001,Vente,152700,,,LE VILLAGE,B051,07240,07214,Saint-Apollinaire-de-Rias,07,,,072140000A0592,,,,,,,,,,,,,0,,,,,S,sols,,,28,4.598819,44.92537
2020-84376,2020-05-29,000001,Vente,152700,,,LE VILLAGE,B051,07240,07214,Saint-Apollinaire-de-Rias,07,,,072140000A0596,,,,,,,,,,,,,0,,,,,S,sols,,,35,4.598684,44.925393
2020-84376,2020-05-29,000001,Vente,152700,,,LE VILLAGE,B051,07240,07214,Saint-Apollinaire-de-Rias,07,,,072140000A0615,,,,,,,,,,,,,0,,,,,T,terres,,,77,4.598911,44.925417
2020-84376,2020-05-29,000001,Vente,152700,,,LE VILLAGE,B051,07240,07214,Saint-Apollinaire-de-Rias,07,,,072140000A0616,,,,,,,,,,,,,0,,,,,T,terres,,,45,4.598979,44.925373
2020-84585,2020-06-18,000001,Vente,1400,,,LE VERNAT,B049,07240,07214,Saint-Apollinaire-de-Rias,07,,,07214000AC0118,,,,,,,,,,,,,0,,,,,BT,taillis simples,,,3335,4.604359,44.900659
2020-84585,2020-06-18,000001,Vente,1400,,,LE VERNAT,B049,07240,07214,Saint-Apollinaire-de-Rias,07,,,07214000AC0119,,,,,,,,,,,,,0,,,,,P,prés,,,5100,4.605431,44.900561
2020-84585,2020-06-18,000001,Vente,1400,,,LE VERNAT,B049,07240,07214,Saint-Apollinaire-de-Rias,07,,,07214000AC0197,,,,,,,,,,,,,0,,,,,T,terres,,,1622,4.605711,44.900949
2020-84585,2020-06-18,000001,Vente,1400,,,LE VERNAT,B049,07240,07214,Saint-Apollinaire-de-Rias,07,,,07214000AC0246,,,,,,,,,,,,,0,,,,,VE,vergers,CHAT,Châtaigneraie,2019,4.60526,44.9015
2020-84674,2020-06-22,000001,Vente,7700,,,LE VILLAGE,B051,07240,07214,Saint-Apollinaire-de-Rias,07,,,072140000A0604,,,,,,,,,,,,,0,,,,,L,landes,,,45,4.599713,44.924857
2020-84674,2020-06-22,000001,Vente,7700,,,LE VILLAGE,B051,07240,07214,Saint-Apollinaire-de-Rias,07,,,072140000A0605,,,,,,,,,,,,,0,,,,,L,landes,,,23,4.599771,44.924836
2020-84674,2020-06-22,000001,Vente,7700,,,LE VILLAGE,B051,07240,07214,Saint-Apollinaire-de-Rias,07,,,072140000A0606,,,,,,,,,,,,,0,,,,,L,landes,,,40,4.599733,44.924903
2020-84674,2020-06-22,000001,Vente,7700,,,LE VILLAGE,B051,07240,07214,Saint-Apollinaire-de-Rias,07,,,072140000A0843,,,,,,,,,,,,,0,,,,,S,sols,,,68,4.599752,44.924955
2020-84820,2020-07-22,000001,Vente,190000,,,PRANEUF,B037,07240,07214,Saint-Apollinaire-de-Rias,07,,,072140000A0652,,,,,,,,,,,,,0,,,,,BT,taillis simples,,,336,4.588976,44.924396
2020-84820,2020-07-22,000001,Vente,190000,,,PRANEUF,B037,07240,07214,Saint-Apollinaire-de-Rias,07,,,072140000A0665,,,,,,,,,,,,,0,,,,,T,terres,,,2100,4.589562,44.924151
2020-84820,2020-07-22,000001,Vente,190000,,,MAISONNEUVE,B032,07240,07214,Saint-Apollinaire-de-Rias,07,,,072140000B0208,,,,,,,,,,,,,0,,,,,BR,futaies résineuses,PIN,Pins,1410,4.591164,44.921773
2020-84820,2020-07-22,000001,Vente,190000,,,MAISONNEUVE,B032,07240,07214,Saint-Apollinaire-de-Rias,07,,,072140000B0209,,,,,,,,,,,,,0,,,,,VE,vergers,CHAT,Châtaigneraie,10000,4.590021,44.920886
2020-84820,2020-07-22,000001,Vente,190000,,,MAISONNEUVE,B032,07240,07214,Saint-Apollinaire-de-Rias,07,,,072140000B0209,,,,,,,,,,,,,0,,,,,BT,taillis simples,,,13100,4.590021,44.920886
2020-84820,2020-07-22,000001,Vente,190000,,,MAISONNEUVE,B032,07240,07214,Saint-Apollinaire-de-Rias,07,,,072140000B0210,,,,,,,,,,,,,0,,,,,L,landes,,,3360,4.58958,44.921191
2020-84820,2020-07-22,000001,Vente,190000,,,MAISONNEUVE,B032,07240,07214,Saint-Apollinaire-de-Rias,07,,,072140000B0211,,,,,,,,,,,,,0,,,,,BR,futaies résineuses,PIN,Pins,6480,4.587636,44.921152
2020-84820,2020-07-22,000001,Vente,190000,,,MAISONNEUVE,B032,07240,07214,Saint-Apollinaire-de-Rias,07,,,072140000B0212,,,,,,,,,,,,,0,,,,,BR,futaies résineuses,PIN,Pins,4700,4.587699,44.9209
2020-84820,2020-07-22,000001,Vente,190000,,,MAISONNEUVE,B032,07240,07214,Saint-Apollinaire-de-Rias,07,,,072140000B0426,,,,,,,,,,,,,0,,,,,BR,futaies résineuses,PIN,Pins,10947,4.588536,44.92191
2020-84820,2020-07-22,000001,Vente,190000,,,MAISONNEUVE,B032,07240,07214,Saint-Apollinaire-de-Rias,07,,,072140000B0427,,,,,,,,,,,,,0,,,,,P,prés,,,19190,4.590264,44.922028
2020-84820,2020-07-22,000001,Vente,190000,,,MAISONNEUVE,B032,07240,07214,Saint-Apollinaire-de-Rias,07,,,072140000B0428,,,,,,,,,,,,,0,,,,,P,prés,,,1250,4.590428,44.922617
2020-84820,2020-07-22,000001,Vente,190000,5094,A,MAISONNEUVE,B032,07240,07214,Saint-Apollinaire-de-Rias,07,,,072140000B0429,,,,,,,,,,,,,0,1,Maison,63,4,S,sols,,,728,4.590688,44.922331
2020-84820,2020-07-22,000001,Vente,190000,5094,,MAISONNEUVE,B032,07240,07214,Saint-Apollinaire-de-Rias,07,,,072140000B0430,,,,,,,,,,,,,0,1,Maison,65,3,S,sols,,,232,4.590737,44.922417
2020-84820,2020-07-22,000001,Vente,190000,,,MAISONNEUVE,B032,07240,07214,Saint-Apollinaire-de-Rias,07,,,072140000B0519,,,,,,,,,,,,,0,,,,,T,terres,,,5818,4.58976,44.923267
2020-84820,2020-07-22,000001,Vente,190000,,,MAISONNEUVE,B032,07240,07214,Saint-Apollinaire-de-Rias,07,,,072140000B0549,,,,,,,,,,,,,0,,,,,BR,futaies résineuses,PIN,Pins,42584,4.587997,44.923445
2020-85059,2020-08-03,000001,Vente,5000,,,JURUSSON,B030,07240,07214,Saint-Apollinaire-de-Rias,07,,,072140000A0344,,,,,,,,,,,,,0,,,,,T,terres,,,7450,4.599439,44.921478
2020-85059,2020-08-03,000001,Vente,5000,,,JURUSSON,B030,07240,07214,Saint-Apollinaire-de-Rias,07,,,072140000A0347,,,,,,,,,,,,,0,,,,,BT,taillis simples,,,1430,4.601143,44.920134
2020-85059,2020-08-03,000001,Vente,5000,,,JURUSSON,B030,07240,07214,Saint-Apollinaire-de-Rias,07,,,072140000A0350,,,,,,,,,,,,,0,,,,,T,terres,,,4580,4.600006,44.919906
2020-85059,2020-08-03,000001,Vente,5000,,,JURUSSON,B030,07240,07214,Saint-Apollinaire-de-Rias,07,,,072140000A0351,,,,,,,,,,,,,0,,,,,P,prés,,,4060,4.600046,44.919606
2020-85059,2020-08-03,000001,Vente,5000,,,JURUS,B029,07240,07214,Saint-Apollinaire-de-Rias,07,,,072140000A0356,,,,,,,,,,,,,0,,,,,T,terres,,,6640,4.599218,44.918089
2020-85059,2020-08-03,000001,Vente,5000,,,JURUS,B029,07240,07214,Saint-Apollinaire-de-Rias,07,,,072140000A0598,,,,,,,,,,,,,0,,,,,P,prés,,,13285,4.598353,44.918951
2020-85063,2020-08-03,000001,Vente,3900,,,JURUS,B029,07240,07214,Saint-Apollinaire-de-Rias,07,,,072140000A0406,,,,,,,,,,,,,0,,,,,T,terres,,,2760,4.597019,44.918691
2020-85063,2020-08-03,000001,Vente,3900,,,PRAGUE,B036,07240,07214,Saint-Apollinaire-de-Rias,07,,,07214000AB0001,,,,,,,,,,,,,0,,,,,P,prés,,,16225,4.603708,44.918453
2020-85063,2020-08-03,000001,Vente,3900,,,PRAGUE,B036,07240,07214,Saint-Apollinaire-de-Rias,07,,,07214000AB0005,,,,,,,,,,,,,0,,,,,T,terres,,,5575,4.603076,44.917894
2020-85064,2020-08-03,000001,Vente,183000,,,LES CHARIVES,B013,07240,07214,Saint-Apollinaire-de-Rias,07,,,072140000A0414,,,,,,,,,,,,,0,,,,,L,landes,,,1570,4.599381,44.917014
2020-85064,2020-08-03,000001,Vente,183000,,,LES CHARIVES,B013,07240,07214,Saint-Apollinaire-de-Rias,07,,,072140000A0415,,,,,,,,,,,,,0,,,,,T,terres,,,2780,4.5991,44.916502
2020-85064,2020-08-03,000001,Vente,183000,,,LES CHARIVES,B013,07240,07214,Saint-Apollinaire-de-Rias,07,,,072140000A0416,,,,,,,,,,,,,0,,,,,P,prés,,,1980,4.599133,44.916431
2020-85064,2020-08-03,000001,Vente,183000,,,LES CHARIVES,B013,07240,07214,Saint-Apollinaire-de-Rias,07,,,072140000A0417,,,,,,,,,,,,,0,,,,,T,terres,,,4680,4.598684,44.916526
2020-85064,2020-08-03,000001,Vente,183000,5032,,LES CHARIVES,B013,07240,07214,Saint-Apollinaire-de-Rias,07,,,072140000A0418,,,,,,,,,,,,,0,1,Maison,130,4,S,sols,,,1320,4.597781,44.916429
2020-85064,2020-08-03,000001,Vente,183000,,,LES CHARIVES,B013,07240,07214,Saint-Apollinaire-de-Rias,07,,,072140000A0791,,,,,,,,,,,,,0,,,,,VI,vignes,,,1313,4.597222,44.91643
2020-85064,2020-08-03,000001,Vente,183000,,,LES CHARIVES,B013,07240,07214,Saint-Apollinaire-de-Rias,07,,,072140000A0841,,,,,,,,,,,,,0,,,,,BT,taillis simples,,,8603,4.597514,44.916796
2020-85064,2020-08-03,000001,Vente,183000,,,LES CHARIVES SUD,B014,07240,07214,Saint-Apollinaire-de-Rias,07,,,07214000AB0176,,,,,,,,,,,,,0,,,,,T,terres,,,8790,4.600248,44.916852
2020-85064,2020-08-03,000001,Vente,183000,,,LES CHARIVES SUD,B014,07240,07214,Saint-Apollinaire-de-Rias,07,,,07214000AB0228,,,,,,,,,,,,,0,,,,,T,terres,,,2000,4.596848,44.916202
2020-85064,2020-08-03,000001,Vente,183000,,,LES CHARIVES SUD,B014,07240,07214,Saint-Apollinaire-de-Rias,07,,,07214000AB0230,,,,,,,,,,,,,0,,,,,BT,taillis simples,,,1880,4.597183,44.915751
2020-85064,2020-08-03,000001,Vente,183000,,,LES CHARIVES SUD,B014,07240,07214,Saint-Apollinaire-de-Rias,07,,,07214000AB0288,,,,,,,,,,,,,0,,,,,P,prés,,,27009,4.59899,44.91594
2020-85076,2020-08-03,000001,Vente,800,,,JURUS,B029,07240,07214,Saint-Apollinaire-de-Rias,07,,,072140000A0355,,,,,,,,,,,,,0,,,,,VE,vergers,CHAT,Châtaigneraie,4830,4.599735,44.917984
2020-85076,2020-08-03,000001,Vente,800,,,JURUS,B029,07240,07214,Saint-Apollinaire-de-Rias,07,,,072140000A0357,,,,,,,,,,,,,0,,,,,L,landes,,,1840,4.5987,44.918123
2020-85076,2020-08-03,000001,Vente,800,,,JURUS,B029,07240,07214,Saint-Apollinaire-de-Rias,07,,,072140000A0358,,,,,,,,,,,,,0,,,,,T,terres,,,1340,4.597701,44.918458
2020-85076,2020-08-03,000001,Vente,800,,,LES CHARIVES SUD,B014,07240,07214,Saint-Apollinaire-de-Rias,07,,,07214000AB0177,,,,,,,,,,,,,0,,,,,L,landes,,,2195,4.600375,44.917321
2020-85297,2020-09-18,000001,Vente,85000,,,ROSSIGNOL,B041,07240,07214,Saint-Apollinaire-de-Rias,07,,,072140000B0332,,,,,,,,,,,,,0,,,,,P,prés,,,5820,4.583144,44.918032
2020-85297,2020-09-18,000001,Vente,85000,5105,,ROSSIGNOL,B041,07240,07214,Saint-Apollinaire-de-Rias,07,,,072140000B0357,,,,,,,,,,,,,0,1,Maison,60,2,S,sols,,,560,4.583273,44.919462
2020-85297,2020-09-18,000001,Vente,85000,,,ROSSIGNOL,B041,07240,07214,Saint-Apollinaire-de-Rias,07,,,072140000B0361,,,,,,,,,,,,,0,,,,,P,prés,,,1540,4.58388,44.919327
2020-85297,2020-09-18,000001,Vente,85000,,,ROSSIGNOL,B041,07240,07214,Saint-Apollinaire-de-Rias,07,,,072140000B0364,,,,,,,,,,,,,0,,,,,L,landes,,,3900,4.582905,44.918608
2020-85297,2020-09-18,000001,Vente,85000,,,ROSSIGNOL,B041,07240,07214,Saint-Apollinaire-de-Rias,07,,,072140000B0365,,,,,,,,,,,,,0,,,,,P,prés,,,3690,4.582633,44.918288
2020-85297,2020-09-18,000001,Vente,85000,,,ROSSIGNOL,B041,07240,07214,Saint-Apollinaire-de-Rias,07,,,072140000B0366,,,,,,,,,,,,,0,,,,,P,prés,,,7180,4.581015,44.919095
2020-85297,2020-09-18,000001,Vente,85000,,,ROSSIGNOL,B041,07240,07214,Saint-Apollinaire-de-Rias,07,,,072140000B0367,,,,,,,,,,,,,0,,,,,P,prés,,,14960,4.581082,44.919805
2020-85297,2020-09-18,000001,Vente,85000,,,ROSSIGNOL,B041,07240,07214,Saint-Apollinaire-de-Rias,07,,,072140000B0368,,,,,,,,,,,,,0,,,,,T,terres,,,3580,4.582264,44.919563
2020-85297,2020-09-18,000001,Vente,85000,,,ROSSIGNOL,B041,07240,07214,Saint-Apollinaire-de-Rias,07,,,072140000B0503,,,,,,,,,,,,,0,,,,,J,jardins,,,183,4.583471,44.919496
2020-85669,2020-10-19,000001,Vente,208000,,,FAMENOISE,B024,07240,07214,Saint-Apollinaire-de-Rias,07,,,07214000AC0051,,,,,,,,,,,,,0,,,,,S,sols,,,37,4.612939,44.8977
2020-85669,2020-10-19,000001,Vente,208000,5071,,LEYRALLON,B031,07240,07214,Saint-Apollinaire-de-Rias,07,,,07214000AC0073,,,,,,,,,,,,,0,1,Maison,95,4,S,sols,,,253,4.612703,44.89765
2020-85669,2020-10-19,000001,Vente,208000,,,LEYRALLON,B031,07240,07214,Saint-Apollinaire-de-Rias,07,,,07214000AC0280,,,,,,,,,,,,,0,,,,,VE,vergers,,,680,4.612844,44.897532
2020-85805,2020-10-30,000001,Vente,460150,,,SERRE D AJOUANOUX,B045,07240,07214,Saint-Apollinaire-de-Rias,07,,,072140000A0146,,,,,,,,,,,,,0,,,,,BT,taillis simples,,,1300,4.593836,44.926434
2020-85805,2020-10-30,000001,Vente,460150,5011,,SERRE D AJOUANOUX,B045,07240,07214,Saint-Apollinaire-de-Rias,07,,,072140000A0147,,,,,,,,,,,,,0,1,Maison,90,4,S,sols,,,524,4.593016,44.926927
2020-85805,2020-10-30,000001,Vente,460150,5011,,SERRE D AJOUANOUX,B045,07240,07214,Saint-Apollinaire-de-Rias,07,,,072140000A0147,,,,,,,,,,,,,0,3,Dépendance,,0,S,sols,,,524,4.593016,44.926927
2020-85805,2020-10-30,000001,Vente,460150,,,SERRE D AJOUANOUX,B045,07240,07214,Saint-Apollinaire-de-Rias,07,,,072140000A0148,,,,,,,,,,,,,0,,,,,L,landes,,,18796,4.593088,44.926905
2020-85805,2020-10-30,000001,Vente,460150,,,SERRE D AJOUANOUX,B045,07240,07214,Saint-Apollinaire-de-Rias,07,,,072140000A0149,,,,,,,,,,,,,0,,,,,BR,futaies résineuses,PIN,Pins,34240,4.591303,44.927232
2020-85805,2020-10-30,000001,Vente,460150,,,SERRE D AJOUANOUX,B045,07240,07214,Saint-Apollinaire-de-Rias,07,,,072140000A0150,,,,,,,,,,,,,0,,,,,BT,taillis simples,,,3140,4.591374,44.926126
2020-85805,2020-10-30,000001,Vente,460150,,,SERRE D AJOUANOUX,B045,07240,07214,Saint-Apollinaire-de-Rias,07,,,072140000A0151,,,,,,,,,,,,,0,,,,,L,landes,,,6070,4.592865,44.925789
2020-85805,2020-10-30,000001,Vente,460150,,,SERRE D AJOUANOUX,B045,07240,07214,Saint-Apollinaire-de-Rias,07,,,072140000A0152,,,,,,,,,,,,,0,,,,,BT,taillis simples,,,2300,4.593485,44.925849
2020-86012,2020-10-29,000001,Vente,127000,,,DOUNON,B022,07240,07214,Saint-Apollinaire-de-Rias,07,,,072140000B0271,,,,,,,,,,,,,0,,,,,L,landes,,,100,4.591226,44.916466
2020-86012,2020-10-29,000001,Vente,127000,5123,,DOUNON,B022,07240,07214,Saint-Apollinaire-de-Rias,07,,,072140000B0280,,,,,,,,,,,,,0,1,Maison,75,2,S,sols,,,310,4.591133,44.916648
2020-86012,2020-10-29,000001,Vente,127000,5123,,DOUNON,B022,07240,07214,Saint-Apollinaire-de-Rias,07,,,072140000B0280,,,,,,,,,,,,,0,3,Dépendance,,0,S,sols,,,310,4.591133,44.916648
2020-86599,2020-12-29,000001,Vente,11000,,,JURUS,B029,07240,07214,Saint-Apollinaire-de-Rias,07,,,072140000A0763,,,,,,,,,,,,,0,,,,,BT,taillis simples,,,641,4.596037,44.918523
2020-86599,2020-12-29,000001,Vente,11000,,,JURUS,B029,07240,07214,Saint-Apollinaire-de-Rias,07,,,072140000A0832,,,,,,,,,,,,,0,,,,,T,terres,,,2120,4.59597,44.918743
