id_mutation,date_mutation,numero_disposition,nature_mutation,valeur_fonciere,adresse_numero,adresse_suffixe,adresse_nom_voie,adresse_code_voie,code_postal,code_commune,nom_commune,code_departement,ancien_code_commune,ancien_nom_commune,id_parcelle,ancien_id_parcelle,numero_volume,lot1_numero,lot1_surface_carrez,lot2_numero,lot2_surface_carrez,lot3_numero,lot3_surface_carrez,lot4_numero,lot4_surface_carrez,lot5_numero,lot5_surface_carrez,nombre_lots,code_type_local,type_local,surface_reelle_bati,nombre_pieces_principales,code_nature_culture,nature_culture,code_nature_culture_speciale,nature_culture_speciale,surface_terrain,longitude,latitude
2020-89489,2020-01-02,000001,Vente,5000,,,LE PLANTY,B061,08190,08004,Aire,08,,,08004000ZB0416,,,,,,,,,,,,,0,,,,,BT,taillis simples,,,2102,4.160708,49.487148
2020-89489,2020-01-02,000001,Vente,5000,,,LE PLANTY,B061,08190,08004,Aire,08,,,08004000ZB0424,,,,,,,,,,,,,0,,,,,BS,taillis sous futaie,,,826,4.160766,49.487679
2020-89489,2020-01-02,000001,Vente,5000,,,LE PLANTY,B061,08190,08004,Aire,08,,,08004000ZB0425,,,,,,,,,,,,,0,,,,,P,prés,,,1500,4.160922,49.487667
2020-89489,2020-01-02,000001,Vente,5000,,,LE PLANTY,B061,08190,08004,Aire,08,,,08004000ZB0426,,,,,,,,,,,,,0,,,,,P,prés,,,4329,4.161085,49.487813
2020-89489,2020-01-02,000001,Vente,5000,,,LE PLANTY,B061,08190,08004,Aire,08,,,08004000ZB0427,,,,,,,,,,,,,0,,,,,BT,taillis simples,,,738,4.161298,49.487152
2020-89489,2020-01-02,000001,Vente,5000,,,LE PLANTY,B061,08190,08004,Aire,08,,,08004000ZB0428,,,,,,,,,,,,,0,,,,,L,landes,FRICH,Friche,641,4.161628,49.487163
2020-89489,2020-01-02,000001,Vente,5000,,,LE PLANTY,B061,08190,08004,Aire,08,,,08004000ZB0430,,,,,,,,,,,,,0,,,,,BP,peupleraies,,,2607,4.161442,49.488115
2020-89489,2020-01-02,000001,Vente,5000,,,LE PLANTY,B061,08190,08004,Aire,08,,,08004000ZB0495,,,,,,,,,,,,,0,,,,,BP,peupleraies,,,6320,4.161963,49.488215
2020-89489,2020-01-02,000001,Vente,5000,,,LE PLANTY,B061,08190,08004,Aire,08,,,08004000ZB0520,,,,,,,,,,,,,0,,,,,BP,peupleraies,,,4628,4.160531,49.486679
2020-89489,2020-01-02,000001,Vente,5000,,,LE PLANTY,B061,08190,08004,Aire,08,,,08004000ZB0521,,,,,,,,,,,,,0,,,,,BT,taillis simples,,,343,4.160907,49.486925
2020-89680,2020-04-16,000001,Vente,82690,,,TRIOT DU RENARD,B076,08190,08004,Aire,08,,,08004000ZO0031,,,,,,,,,,,,,0,,,,,T,terres,,,30857,4.167645,49.461265
2020-89825,2020-06-26,000001,Vente,155000,33,,RUE DU MOULIN,0084,08190,08004,Aire,08,,,08004000AB0292,,,,,,,,,,,,,0,1,Maison,170,6,S,sols,,,574,4.162768,49.479553
2020-89825,2020-06-26,000001,Vente,155000,,,LE VILLAGE,B077,08190,08004,Aire,08,,,08004000AB0383,,,,,,,,,,,,,0,,,,,S,sols,,,73,4.162798,49.479621
2020-89825,2020-06-26,000001,Vente,155000,,,LE VILLAGE,B077,08190,08004,Aire,08,,,08004000AB0384,,,,,,,,,,,,,0,,,,,S,sols,,,40,4.163053,49.479589
2020-89825,2020-06-26,000001,Vente,155000,,,LE VILLAGE,B077,08190,08004,Aire,08,,,08004000AB0385,,,,,,,,,,,,,0,,,,,BT,taillis simples,,,157,4.163069,49.479494
2020-89829,2020-06-19,000001,Vente,2311,,,LE VILLAGE,B077,08190,08004,Aire,08,,,08004000AB0109,,,,,,,,,,,,,0,,,,,BT,taillis simples,,,228,4.160423,49.479391
2020-89829,2020-06-19,000001,Vente,2311,,,LE VILLAGE,B077,08190,08004,Aire,08,,,08004000AB0115,,,,,,,,,,,,,0,,,,,BT,taillis simples,,,653,4.160915,49.479804
2020-89829,2020-06-19,000001,Vente,2311,,,COTE GOBERT,B020,08190,08004,Aire,08,,,08004000AB0176,,,,,,,,,,,,,0,,,,,BT,taillis simples,,,222,4.158616,49.480087
2020-89829,2020-06-19,000001,Vente,2311,,,COTE GOBERT,B020,08190,08004,Aire,08,,,08004000AB0195,,,,,,,,,,,,,0,,,,,L,landes,FRICH,Friche,1254,4.159052,49.479795
2020-89829,2020-06-19,000001,Vente,2311,,,GAVARD,B033,08190,08004,Aire,08,,,08004000AB0287,,,,,,,,,,,,,0,,,,,BT,taillis simples,,,645,4.165945,49.479458
2020-89829,2020-06-19,000001,Vente,2311,,,SOUS LES MONTS,B074,08190,08004,Aire,08,,,08004000ZA0086,,,,,,,,,,,,,0,,,,,BT,taillis simples,,,970,4.144058,49.477507
2020-89829,2020-06-19,000001,Vente,2311,,,FOND DES NEAUX,B031,08190,08004,Aire,08,,,08004000ZA0259,,,,,,,,,,,,,0,,,,,BS,taillis sous futaie,,,1181,4.148545,49.486819
2020-89829,2020-06-19,000001,Vente,2311,,,FOND DES NEAUX,B031,08190,08004,Aire,08,,,08004000ZA0299,,,,,,,,,,,,,0,,,,,BT,taillis simples,,,312,4.147587,49.487361
2020-89829,2020-06-19,000001,Vente,2311,,,FOND DES NEAUX,B031,08190,08004,Aire,08,,,08004000ZA0311,,,,,,,,,,,,,0,,,,,BS,taillis sous futaie,,,1555,4.146557,49.486729
2020-89829,2020-06-19,000001,Vente,2311,,,BIENS COMMUNAUX,B006,08190,08004,Aire,08,,,08004000ZA0435,,,,,,,,,,,,,0,,,,,BS,taillis sous futaie,,,560,4.148299,49.483955
2020-89829,2020-06-19,000001,Vente,2311,,,LES PETITES ILES,B059,08190,08004,Aire,08,,,08004000ZA0554,,,,,,,,,,,,,0,,,,,BS,taillis sous futaie,,,266,4.142741,49.482309
2020-89829,2020-06-19,000001,Vente,2311,,,LES SARTS,B068,08190,08004,Aire,08,,,08004000ZA0606,,,,,,,,,,,,,0,,,,,BS,taillis sous futaie,,,391,4.142548,49.480861
2020-89829,2020-06-19,000001,Vente,2311,,,BOIS HULOT,B007,08190,08004,Aire,08,,,08004000ZA0619,,,,,,,,,,,,,0,,,,,BS,taillis sous futaie,,,342,4.146101,49.481105
2020-89829,2020-06-19,000001,Vente,2311,,,COTE ALISSE,B017,08190,08004,Aire,08,,,08004000ZA0713,,,,,,,,,,,,,0,,,,,BT,taillis simples,,,269,4.148911,49.479078
2020-89829,2020-06-19,000001,Vente,2311,,,COTE DU PICHOT,B018,08190,08004,Aire,08,,,08004000ZB0237,,,,,,,,,,,,,0,,,,,BT,taillis simples,,,136,4.155023,49.477697
2020-89829,2020-06-19,000001,Vente,2311,,,LA BARAQUE,B001,08190,08004,Aire,08,,,08004000ZB0313,,,,,,,,,,,,,0,,,,,BT,taillis simples,,,277,4.156384,49.484106
2020-90028,2020-09-16,000001,Vente,140000,5103,,ALL DES BOSQUETS,0087,08190,08004,Aire,08,,,08004000ZB0512,,,,,,,,,,,,,0,4,Local industriel. commercial ou assimilé,747,0,S,sols,,,1340,4.160973,49.483515
2020-90052,2020-09-25,000001,Vente,108000,23,,RUE DU MOULIN,0084,08190,08004,Aire,08,,,08004000AB0407,,,,,,,,,,,,,0,1,Maison,101,5,S,sols,,,278,4.162284,49.480722
2020-90226,2020-11-20,000001,Vente,145500,8,,RTE DE BELLEVUE,0085,08190,08004,Aire,08,,,08004000ZB0439,,,,,,,,,,,,,0,4,Local industriel. commercial ou assimilé,200,0,S,sols,,,418,4.164568,49.486453
2020-90226,2020-11-20,000001,Vente,145500,8,,RTE DE BELLEVUE,0085,08190,08004,Aire,08,,,08004000ZB0439,,,,,,,,,,,,,0,1,Maison,160,6,S,sols,,,418,4.164568,49.486453
