id_mutation,date_mutation,numero_disposition,nature_mutation,valeur_fonciere,adresse_numero,adresse_suffixe,adresse_nom_voie,adresse_code_voie,code_postal,code_commune,nom_commune,code_departement,ancien_code_commune,ancien_nom_commune,id_parcelle,ancien_id_parcelle,numero_volume,lot1_numero,lot1_surface_carrez,lot2_numero,lot2_surface_carrez,lot3_numero,lot3_surface_carrez,lot4_numero,lot4_surface_carrez,lot5_numero,lot5_surface_carrez,nombre_lots,code_type_local,type_local,surface_reelle_bati,nombre_pieces_principales,code_nature_culture,nature_culture,code_nature_culture_speciale,nature_culture_speciale,surface_terrain,longitude,latitude
2020-91466,2020-01-29,000001,Vente,1000,,,LE CHAMP LE CANARD,B051,08240,08086,Briquenay,08,,,08086000ZA0053,,,,,,,,,,,,,0,,,,,P,prés,,,3280,4.883982,49.38737
2020-91753,2020-08-05,000001,Vente,6580,,,LANNEHAYE,B041,08240,08086,Briquenay,08,,,08086000ZK0026,,,,,,,,,,,,,0,,,,,P,prés,,,940,4.883068,49.406493
2020-91760,2020-08-06,000001,Vente,72000,5007,,LA-BARAQUE,B019,08240,08086,Briquenay,08,,,08086000ZC0082,,,,,,,,,,,,,0,1,Maison,25,0,P,prés,,,7232,4.874627,49.405356
2020-91760,2020-08-06,000001,Vente,72000,5007,,LA-BARAQUE,B019,08240,08086,Briquenay,08,,,08086000ZC0082,,,,,,,,,,,,,0,1,Maison,25,0,S,sols,,,500,4.874627,49.405356
2020-92049,2020-12-28,000001,Vente,12000,,,COTE-THIERAUDIERE,B010,08240,08086,Briquenay,08,,,08086000AB0102,,,,,,,,,,,,,0,,,,,BS,taillis sous futaie,,,483,4.866423,49.407303
2020-92049,2020-12-28,000001,Vente,12000,,,COTE-THIERAUDIERE,B010,08240,08086,Briquenay,08,,,08086000AB0110,,,,,,,,,,,,,0,,,,,BS,taillis sous futaie,,,8430,4.8646,49.406714
2020-92049,2020-12-28,000001,Vente,12000,,,LA-NAU-FOUGNETTE,B032,08240,08086,Briquenay,08,,,08086000AB0176,,,,,,,,,,,,,0,,,,,BS,taillis sous futaie,,,4490,4.863241,49.405154
2020-92049,2020-12-28,000001,Vente,12000,,,LE-CHAMP-LE-CANARD,B051,08240,08086,Briquenay,08,,,08086000ZA0055,,,,,,,,,,,,,0,,,,,BT,taillis simples,,,3890,4.887442,49.388817
2020-92049,2020-12-28,000001,Vente,12000,,,FONTAINE-PIERRE-PALIS,B013,08240,08086,Briquenay,08,,,08086000ZB0205,,,,,,,,,,,,,0,,,,,BS,taillis sous futaie,,,12270,4.87771,49.394449
