id_mutation,date_mutation,numero_disposition,nature_mutation,valeur_fonciere,adresse_numero,adresse_suffixe,adresse_nom_voie,adresse_code_voie,code_postal,code_commune,nom_commune,code_departement,ancien_code_commune,ancien_nom_commune,id_parcelle,ancien_id_parcelle,numero_volume,lot1_numero,lot1_surface_carrez,lot2_numero,lot2_surface_carrez,lot3_numero,lot3_surface_carrez,lot4_numero,lot4_surface_carrez,lot5_numero,lot5_surface_carrez,nombre_lots,code_type_local,type_local,surface_reelle_bati,nombre_pieces_principales,code_nature_culture,nature_culture,code_nature_culture_speciale,nature_culture_speciale,surface_terrain,longitude,latitude
2020-91439,2020-01-13,000001,Vente,55000,,,LES DOUZE JOURS,B033,08400,08130,Contreuve,08,,,08130000ZL0002,,,,,,,,,,,,,0,,,,,T,terres,,,31160,4.607035,49.358102
2020-91439,2020-01-13,000001,Vente,55000,,,LES DOUZE JOURS,B033,08400,08130,Contreuve,08,,,08130000ZL0002,,,,,,,,,,,,,0,,,,,T,terres,,,11010,4.607035,49.358102
2020-91439,2020-01-13,000001,Vente,55000,,,LES DOUZE JOURS,B033,08400,08130,Contreuve,08,,,08130000ZL0002,,,,,,,,,,,,,0,,,,,T,terres,,,4920,4.607035,49.358102
2020-91439,2020-01-13,000001,Vente,55000,,,LES DOUZE JOURS,B033,08400,08130,Contreuve,08,,,08130000ZL0002,,,,,,,,,,,,,0,,,,,L,landes,FRICH,Friche,4740,4.607035,49.358102
2020-91687,2020-06-26,000001,Vente,80000,,,LE VILLAGE,B082,08400,08130,Contreuve,08,,,08130000AB0394,,,,,,,,,,,,,0,,,,,S,sols,,,11,4.625536,49.362391
2020-91687,2020-06-26,000001,Vente,80000,,,LE VILLAGE,B082,08400,08130,Contreuve,08,,,08130000AB0397,,,,,,,,,,,,,0,,,,,S,sols,,,5,4.625655,49.362499
2020-91687,2020-06-26,000001,Vente,80000,10,,RUE DU LAVOIR,0009,08400,08130,Contreuve,08,,,08130000AB0438,,,,,,,,,,,,,0,,,,,S,sols,,,10,4.625844,49.362415
2020-91687,2020-06-26,000001,Vente,80000,8,,RUE DU LAVOIR,0009,08400,08130,Contreuve,08,,,08130000AB0441,,,,,,,,,,,,,0,4,Local industriel. commercial ou assimilé,466,0,S,sols,,,466,4.625695,49.362383
2020-91710,2020-07-24,000001,Vente,4950,,,LE VILLAGE,B082,08400,08130,Contreuve,08,,,08130000AB0173,,,,,,,,,,,,,0,,,,,L,landes,FRICH,Friche,43,4.62466,49.359956
2020-91710,2020-07-24,000001,Vente,4950,,,LE VILLAGE,B082,08400,08130,Contreuve,08,,,08130000AB0301,,,,,,,,,,,,,0,,,,,L,landes,FRICH,Friche,162,4.625004,49.359989
2020-91710,2020-07-24,000001,Vente,4950,,,LE VILLAGE,B082,08400,08130,Contreuve,08,,,08130000AB0305,,,,,,,,,,,,,0,,,,,L,landes,FRICH,Friche,295,4.624954,49.360023
2020-91710,2020-07-24,000001,Vente,4950,,,LE VILLAGE,B082,08400,08130,Contreuve,08,,,08130000AB0307,,,,,,,,,,,,,0,,,,,L,landes,FRICH,Friche,778,4.624972,49.359905
2020-91714,2020-07-24,000001,Vente,5000,,,LE VILLAGE,B082,08400,08130,Contreuve,08,,,08130000AB0101,,,,,,,,,,,,,0,,,,,S,sols,,,2675,4.623879,49.362629
2020-91905,2020-11-03,000002,Vente,3128,,,LE VILLAGE,B082,08400,08130,Contreuve,08,,,08130000AB0446,,,,,,,,,,,,,0,,,,,P,prés,,,391,4.622248,49.360768
2020-92018,2020-12-18,000001,Vente,85300,3,,RUE DU BOULANGER,0004,08400,08130,Contreuve,08,,,08130000AB0267,,,,,,,,,,,,,0,1,Maison,55,3,S,sols,,,472,,
2020-92018,2020-12-18,000001,Vente,85300,5061,,RUE DU BOULANGER,0004,08400,08130,Contreuve,08,,,08130000AB0348,,,,,,,,,,,,,0,3,Dépendance,,0,J,jardins,,,373,,
2020-92018,2020-12-18,000001,Vente,85300,5061,,RUE DU BOULANGER,0004,08400,08130,Contreuve,08,,,08130000AB0348,,,,,,,,,,,,,0,3,Dépendance,,0,S,sols,,,38,,
2020-92018,2020-12-18,000001,Vente,85300,,,LE VILLAGE,B082,08400,08130,Contreuve,08,,,08130000AB0350,,,,,,,,,,,,,0,,,,,J,jardins,,,103,,
2020-92018,2020-12-18,000001,Vente,85300,1,,RUE DU BOULANGER,0004,08400,08130,Contreuve,08,,,08130000AB0369,,,,,,,,,,,,,0,1,Maison,55,3,S,sols,,,395,,
2020-92018,2020-12-18,000001,Vente,85300,,,LE VILLAGE,B082,08400,08130,Contreuve,08,,,08130000AB0370,,,,,,,,,,,,,0,,,,,J,jardins,,,54,,
2020-92034,2020-12-29,000001,Vente,24000,,,LE PETIT POMMIER,B064,08400,08130,Contreuve,08,,,08130000ZK0011,,,,,,,,,,,,,0,,,,,T,terres,,,4640,4.624075,49.34463
2020-92035,2020-12-29,000001,Vente,31000,,,DUR CUIR,B034,08400,08130,Contreuve,08,,,08130000ZD0019,,,,,,,,,,,,,0,,,,,L,landes,FRICH,Friche,900,4.623757,49.368091
2020-92035,2020-12-29,000001,Vente,31000,,,DUR CUIR,B034,08400,08130,Contreuve,08,,,08130000ZD0019,,,,,,,,,,,,,0,,,,,T,terres,,,11890,4.623757,49.368091
2020-92035,2020-12-29,000001,Vente,31000,,,DUR CUIR,B034,08400,08130,Contreuve,08,,,08130000ZD0019,,,,,,,,,,,,,0,,,,,T,terres,,,15480,4.623757,49.368091
2020-92035,2020-12-29,000001,Vente,31000,,,LES ROIES MONTANTES,B073,08400,08130,Contreuve,08,,,08130000ZD0037,,,,,,,,,,,,,0,,,,,T,terres,,,2560,4.627487,49.365757
2020-92035,2020-12-29,000001,Vente,31000,,,LES ROIES MONTANTES,B073,08400,08130,Contreuve,08,,,08130000ZD0038,,,,,,,,,,,,,0,,,,,T,terres,,,8060,4.627094,49.365665
