id_mutation,date_mutation,numero_disposition,nature_mutation,valeur_fonciere,adresse_numero,adresse_suffixe,adresse_nom_voie,adresse_code_voie,code_postal,code_commune,nom_commune,code_departement,ancien_code_commune,ancien_nom_commune,id_parcelle,ancien_id_parcelle,numero_volume,lot1_numero,lot1_surface_carrez,lot2_numero,lot2_surface_carrez,lot3_numero,lot3_surface_carrez,lot4_numero,lot4_surface_carrez,lot5_numero,lot5_surface_carrez,nombre_lots,code_type_local,type_local,surface_reelle_bati,nombre_pieces_principales,code_nature_culture,nature_culture,code_nature_culture_speciale,nature_culture_speciale,surface_terrain,longitude,latitude
2020-91437,2020-01-28,000001,Vente,1000,,,LE VILLAGE,B127,08130,08244,Lametz,08,,,08244000AB0016,,,,,,,,,,,,,0,,,,,P,prés,,,271,4.688216,49.531062
2020-91437,2020-01-28,000001,Vente,1000,,,LE VILLAGE,B127,08130,08244,Lametz,08,,,08244000AB0018,,,,,,,,,,,,,0,,,,,S,sols,,,91,4.688371,49.531017
2020-91499,2020-02-24,000001,Vente,700,,,MAHOURDEAU,B069,08130,08244,Lametz,08,,,08244000ZC0037,,,,,,,,,,,,,0,,,,,P,prés,,,1804,4.690429,49.528852
2020-91563,2020-04-17,000001,Vente,194666,,,BIEMONT,B008,08130,08244,Lametz,08,,,082440000A0036,,,,,,,,,,,,,0,,,,,BS,taillis sous futaie,,,5911,4.694661,49.539418
2020-91800,2020-09-21,000001,Vente,11300,,,LA CENSE DES BOIS,B019,08130,08244,Lametz,08,,,082440000B0077,,,,,,,,,,,,,0,,,,,BS,taillis sous futaie,,,944,4.702164,49.521319
2020-91800,2020-09-21,000001,Vente,11300,,,FROUMIZELLE,B049,08130,08244,Lametz,08,,,082440000B0144,,,,,,,,,,,,,0,,,,,BT,taillis simples,,,3240,4.701653,49.52056
2020-91846,2020-09-28,000001,Vente,60000,,,LE VILLAGE,B127,08130,08244,Lametz,08,,,08244000AB0110,,,,,,,,,,,,,0,,,,,S,sols,,,105,4.691143,49.530696
2020-91846,2020-09-28,000001,Vente,60000,3,,RUE DU CHENE,0007,08130,08244,Lametz,08,,,08244000AB0111,,,,,,,,,,,,,0,1,Maison,80,3,S,sols,,,157,4.691296,49.530587
2020-91846,2020-09-28,000001,Vente,60000,,,LE VILLAGE,B127,08130,08244,Lametz,08,,,08244000AB0112,,,,,,,,,,,,,0,,,,,J,jardins,,,479,4.691357,49.530722
2020-91846,2020-09-28,000001,Vente,60000,,,LE VILLAGE,B127,08130,08244,Lametz,08,,,08244000AB0113,,,,,,,,,,,,,0,,,,,J,jardins,,,488,4.691703,49.530813
