id_mutation,date_mutation,numero_disposition,nature_mutation,valeur_fonciere,adresse_numero,adresse_suffixe,adresse_nom_voie,adresse_code_voie,code_postal,code_commune,nom_commune,code_departement,ancien_code_commune,ancien_nom_commune,id_parcelle,ancien_id_parcelle,numero_volume,lot1_numero,lot1_surface_carrez,lot2_numero,lot2_surface_carrez,lot3_numero,lot3_surface_carrez,lot4_numero,lot4_surface_carrez,lot5_numero,lot5_surface_carrez,nombre_lots,code_type_local,type_local,surface_reelle_bati,nombre_pieces_principales,code_nature_culture,nature_culture,code_nature_culture_speciale,nature_culture_speciale,surface_terrain,longitude,latitude
2020-86823,2020-01-28,000001,Vente,152500,5158,,CHE DE LA MESSE,0011,08460,08389,Saint-Marcel,08,,,08389000ZL0078,,,,,,,,,,,,,0,1,Maison,73,4,S,sols,,,1190,4.562949,49.763254
2020-87073,2020-03-06,000001,Vente,160000,5126,,LA LAMPE,B096,08460,08389,Saint-Marcel,08,,,08389000ZH0001,,,,,,,,,,,,,0,1,Maison,200,7,S,sols,,,9269,4.578025,49.764868
2020-87073,2020-03-06,000001,Vente,160000,5126,,LA LAMPE,B096,08460,08389,Saint-Marcel,08,,,08389000ZH0001,,,,,,,,,,,,,0,1,Maison,200,7,P,prés,,,2000,4.578025,49.764868
2020-87073,2020-03-06,000001,Vente,160000,5126,,LA LAMPE,B096,08460,08389,Saint-Marcel,08,,,08389000ZH0001,,,,,,,,,,,,,0,1,Maison,200,7,P,prés,,,9000,4.578025,49.764868
2020-87229,2020-04-03,000001,Vente,10000,,,GUEPIN,B086,08460,08389,Saint-Marcel,08,,,08389000ZL0011,,,,,,,,,,,,,0,,,,,T,terres,,,1357,4.553892,49.761783
2020-87231,2020-04-03,000001,Vente,20000,,,GIRAUMONT,B076,08460,08389,Saint-Marcel,08,,,08389000AC0059,,,,,,,,,,,,,0,,,,,VE,vergers,,,532,4.558244,49.764418
2020-87231,2020-04-03,000001,Vente,20000,,,GIRAUMONT,B076,08460,08389,Saint-Marcel,08,,,08389000AC0060,,,,,,,,,,,,,0,,,,,J,jardins,,,255,4.558212,49.764293
2020-87231,2020-04-03,000001,Vente,20000,,,GIRAUMONT,B076,08460,08389,Saint-Marcel,08,,,08389000AC0061,,,,,,,,,,,,,0,,,,,S,sols,,,21,4.558138,49.764249
2020-87231,2020-04-03,000001,Vente,20000,,,GIRAUMONT,B076,08460,08389,Saint-Marcel,08,,,08389000AC0248,,,,,,,,,,,,,0,,,,,P,prés,,,798,4.557495,49.764318
2020-87732,2020-06-12,000001,Vente,6000,,,GUEPIN,B086,08460,08389,Saint-Marcel,08,,,08389000ZL0005,,,,,,,,,,,,,0,,,,,T,terres,,,777,4.553819,49.762473
2020-87857,2020-07-01,000001,Vente,225000,1,,RUE DE GUEPIN,0008,08460,08389,Saint-Marcel,08,,,08389000ZL0012,,,,,,,,,,,,,0,1,Maison,83,4,P,prés,,,1050,,
2020-87857,2020-07-01,000001,Vente,225000,1,,RUE DE GUEPIN,0008,08460,08389,Saint-Marcel,08,,,08389000ZL0012,,,,,,,,,,,,,0,1,Maison,83,4,S,sols,,,1049,,
2020-87857,2020-07-01,000001,Vente,225000,,,GUEPIN,B086,08460,08389,Saint-Marcel,08,,,08389000ZL0013,,,,,,,,,,,,,0,,,,,T,terres,,,383,,
2020-88316,2020-08-12,000001,Vente,512.24,,,PRE DES CHIENS,B114,08460,08389,Saint-Marcel,08,,,08389000ZE0203,,,,,,,,,,,,,0,,,,,S,sols,,,1348,4.593644,49.784151
2020-88764,2020-10-09,000001,Vente,15000,,,GIRAUMONT,B076,08460,08389,Saint-Marcel,08,,,08389000AC0062,,,,,,,,,,,,,0,,,,,J,jardins,,,1057,4.558477,49.764316
2020-88764,2020-10-09,000001,Vente,15000,,,GIRAUMONT,B076,08460,08389,Saint-Marcel,08,,,08389000AC0063,,,,,,,,,,,,,0,,,,,S,sols,,,12,4.558292,49.764093
2020-89368,2020-12-21,000001,Vente,219800,8,T,RUE DE NANDREVILLE,0013,08460,08389,Saint-Marcel,08,,,08389000AC0236,,,,,,,,,,,,,0,1,Maison,107,4,P,prés,,,456,4.561888,49.764328
2020-89368,2020-12-21,000001,Vente,219800,8,T,RUE DE NANDREVILLE,0013,08460,08389,Saint-Marcel,08,,,08389000AC0236,,,,,,,,,,,,,0,1,Maison,107,4,S,sols,,,1000,4.561888,49.764328
2020-89460,2020-12-29,000002,Vente,27000,,,SART JADO,B130,08460,08389,Saint-Marcel,08,,,08389000ZI0050,,,,,,,,,,,,,0,,,,,AB,terrains a bâtir,,,795,4.575506,49.763623
2020-89461,2020-12-29,000001,Vente,1,,,SART JADO,B130,08460,08389,Saint-Marcel,08,,,08389000ZI0051,,,,,,,,,,,,,0,,,,,AB,terrains a bâtir,,,178,4.575507,49.763738
2020-89461,2020-12-29,000001,Vente,1,,,SART JADO,B130,08460,08389,Saint-Marcel,08,,,08389000ZI0054,,,,,,,,,,,,,0,,,,,P,prés,,,184,4.575943,49.764015
