id_mutation,date_mutation,numero_disposition,nature_mutation,valeur_fonciere,adresse_numero,adresse_suffixe,adresse_nom_voie,adresse_code_voie,code_postal,code_commune,nom_commune,code_departement,ancien_code_commune,ancien_nom_commune,id_parcelle,ancien_id_parcelle,numero_volume,lot1_numero,lot1_surface_carrez,lot2_numero,lot2_surface_carrez,lot3_numero,lot3_surface_carrez,lot4_numero,lot4_surface_carrez,lot5_numero,lot5_surface_carrez,nombre_lots,code_type_local,type_local,surface_reelle_bati,nombre_pieces_principales,code_nature_culture,nature_culture,code_nature_culture_speciale,nature_culture_speciale,surface_terrain,longitude,latitude
2020-92281,2020-01-28,000001,Vente,289000,91,,LABOUCHE,B018,09160,09041,La Bastide-du-Salat,09,,,090410000B0104,,,,,,,,,,,,,0,1,Maison,137,4,S,sols,,,1317,1.021372,43.059198
2020-92281,2020-01-28,000001,Vente,289000,91,A,LABOUCHE,B018,09160,09041,La Bastide-du-Salat,09,,,090410000B0105,,,,,,,,,,,,,0,3,Dépendance,,0,S,sols,,,920,1.021221,43.059443
2020-92281,2020-01-28,000001,Vente,289000,,,LABOUCHE,B018,09160,09041,La Bastide-du-Salat,09,,,090410000B0778,,,,,,,,,,,,,0,,,,,S,sols,,,72,1.021366,43.059098
2020-92281,2020-01-28,000001,Vente,289000,,,LABOUCHE,B018,09160,09041,La Bastide-du-Salat,09,,,090410000B0779,,,,,,,,,,,,,0,,,,,S,sols,,,51,1.021463,43.059058
2020-92864,2020-03-13,000001,Vente,3000,,,GOUTETS ET CUGUERBOUCH,B015,09160,09041,La Bastide-du-Salat,09,,,090410000B0026,,,,,,,,,,,,,0,,,,,BT,taillis simples,,,17700,1.00959,43.062764
2020-93261,2020-04-14,000001,Vente,12000,,,GOUTETS ET CUGUERBOUCH,B015,09160,09041,La Bastide-du-Salat,09,,,090410000B0021,,,,,,,,,,,,,0,,,,,BT,taillis simples,,,3745,1.007452,43.064139
2020-93261,2020-04-14,000001,Vente,12000,,,CRABASSE,B008,09160,09041,La Bastide-du-Salat,09,,,090410000B0061,,,,,,,,,,,,,0,,,,,BT,taillis simples,,,7442,1.013102,43.062022
2020-93261,2020-04-14,000001,Vente,12000,,,VIGNOLES,B043,09160,09041,La Bastide-du-Salat,09,,,090410000B0555,,,,,,,,,,,,,0,,,,,BT,taillis simples,,,560,1.004353,43.054708
2020-93261,2020-04-14,000001,Vente,12000,,,VIGNOLES,B043,09160,09041,La Bastide-du-Salat,09,,,090410000B0556,,,,,,,,,,,,,0,,,,,BT,taillis simples,,,2685,1.003592,43.054984
2020-93261,2020-04-14,000001,Vente,12000,,,VIGNOLES,B043,09160,09041,La Bastide-du-Salat,09,,,090410000B0557,,,,,,,,,,,,,0,,,,,BT,taillis simples,,,565,1.003909,43.055206
2020-93261,2020-04-14,000001,Vente,12000,,,VIGNOLES,B043,09160,09041,La Bastide-du-Salat,09,,,090410000B0558,,,,,,,,,,,,,0,,,,,BT,taillis simples,,,2303,1.004564,43.055126
2020-93261,2020-04-14,000001,Vente,12000,,,VIGNOLES,B043,09160,09041,La Bastide-du-Salat,09,,,090410000B0559,,,,,,,,,,,,,0,,,,,BT,taillis simples,,,10721,1.004786,43.055104
2020-93261,2020-04-14,000001,Vente,12000,,,VIGNOLES,B043,09160,09041,La Bastide-du-Salat,09,,,090410000B0560,,,,,,,,,,,,,0,,,,,BT,taillis simples,,,3820,1.005344,43.055431
2020-93317,2020-04-08,000002,Vente,182400,5176,,TROIS CHEMINS ET BASSES,B039,09160,09041,La Bastide-du-Salat,09,,,090410000B0951,,,,,,,,,,,,,0,1,Maison,135,4,,,,,,0.991351,43.056902
2020-93352,2020-05-07,000001,Vente,375000,107,,RIBASSES,B036,09160,09041,La Bastide-du-Salat,09,,,090410000B0327,,,2,,,,,,,,,,1,4,Local industriel. commercial ou assimilé,,,,,,,,0.985036,43.054691
2020-93352,2020-05-07,000001,Vente,375000,,,RIBASSES,B036,09160,09041,La Bastide-du-Salat,09,,,090410000B0341,,,,,,,,,,,,,0,,,,,P,prés,,,1705,0.985114,43.053101
2020-93352,2020-05-07,000001,Vente,375000,,,RIBASSES,B036,09160,09041,La Bastide-du-Salat,09,,,090410000B0351,,,,,,,,,,,,,0,,,,,BP,peupleraies,,,3520,0.98499,43.052564
2020-93352,2020-05-07,000001,Vente,375000,,,RIBASSES,B036,09160,09041,La Bastide-du-Salat,09,,,090410000B0352,,,,,,,,,,,,,0,,,,,BP,peupleraies,,,2147,0.985043,43.052151
2020-95350,2020-09-24,000001,Vente,1000,,,LANOTE,B019,09160,09041,La Bastide-du-Salat,09,,,090410000A0493,,,,,,,,,,,,,0,,,,,T,terres,,,1970,0.988072,43.060519
2020-95351,2020-09-24,000001,Vente,450,,,LANOTE,B019,09160,09041,La Bastide-du-Salat,09,,,090410000A0456,,,,,,,,,,,,,0,,,,,T,terres,,,1290,0.988532,43.061123
2020-95909,2020-10-30,000001,Vente,65000,77,,PRE COMMUN,B033,09160,09041,La Bastide-du-Salat,09,,,090410000B0265,,,,,,,,,,,,,0,1,Maison,114,4,S,sols,,,120,0.987336,43.055735
2020-96402,2020-11-18,000001,Vente,3000,,,LANOTE,B019,09160,09041,La Bastide-du-Salat,09,,,090410000A0615,,,,,,,,,,,,,0,,,,,T,terres,,,6121,0.987259,43.058721
2020-96500,2020-11-18,000001,Echange,2400,,,GOUTE DE LA FORGUE,B013,09160,09041,La Bastide-du-Salat,09,,,090410000A0644,,,,,,,,,,,,,0,,,,,BT,taillis simples,,,2595,0.993463,43.069394
2020-96500,2020-11-18,000001,Echange,2400,,,LANOTE,B019,09160,09041,La Bastide-du-Salat,09,,,090410000A0650,,,,,,,,,,,,,0,,,,,T,terres,,,2570,0.98706,43.058972
2020-96500,2020-11-18,000001,Echange,2400,,,TUILERIE,B041,09160,09041,La Bastide-du-Salat,09,,,090410000B0505,,,,,,,,,,,,,0,,,,,P,prés,,,6010,0.99715,43.055705
2020-96815,2020-12-30,000001,Vente,146700,,,PRE COMMUN,B033,09160,09041,La Bastide-du-Salat,09,,,090410000B0925,,,,,,,,,,,,,0,,,,,J,jardins,,,143,0.986591,43.054896
2020-96815,2020-12-30,000001,Vente,146700,5168,,PRE COMMUN,B033,09160,09041,La Bastide-du-Salat,09,,,090410000B0944,,,,,,,,,,,,,0,1,Maison,149,4,S,sols,,,199,0.986505,43.0551
2020-96832,2020-12-17,000001,Vente,4230,,,PLAINE D ENHAUT ET CARRERA,B030,09160,09041,La Bastide-du-Salat,09,,,090410000B0673,,,,,,,,,,,,,0,,,,,T,terres,,,4706,0.997168,43.050605
2020-96832,2020-12-17,000001,Vente,4230,,,PLAINE D ENHAUT ET CARRERA,B030,09160,09041,La Bastide-du-Salat,09,,,090410000B0812,,,,,,,,,,,,,0,,,,,T,terres,,,895,0.996769,43.050232
