id_mutation,date_mutation,numero_disposition,nature_mutation,valeur_fonciere,adresse_numero,adresse_suffixe,adresse_nom_voie,adresse_code_voie,code_postal,code_commune,nom_commune,code_departement,ancien_code_commune,ancien_nom_commune,id_parcelle,ancien_id_parcelle,numero_volume,lot1_numero,lot1_surface_carrez,lot2_numero,lot2_surface_carrez,lot3_numero,lot3_surface_carrez,lot4_numero,lot4_surface_carrez,lot5_numero,lot5_surface_carrez,nombre_lots,code_type_local,type_local,surface_reelle_bati,nombre_pieces_principales,code_nature_culture,nature_culture,code_nature_culture_speciale,nature_culture_speciale,surface_terrain,longitude,latitude
2020-92547,2020-01-30,000001,Vente,7000,,,AUROUCH,B005,09160,09091,Cazavet,09,,,090910000B1102,,,,,,,,,,,,,0,,,,,P,prés,,,6350,1.032413,42.979196
2020-92547,2020-01-30,000001,Vente,7000,,,AUROUCH,B005,09160,09091,Cazavet,09,,,090910000B1106,,,,,,,,,,,,,0,,,,,S,sols,,,138,1.033546,42.978533
2020-92547,2020-01-30,000001,Vente,7000,,,AUROUCH,B005,09160,09091,Cazavet,09,,,090910000B1109,,,,,,,,,,,,,0,,,,,L,landes,,,5600,1.034138,42.97836
2020-93328,2020-02-11,000002,Vente,2500,1,,RUE LE CARRERAUT,0015,09160,09091,Cazavet,09,,,090910000B1316,,,,,,,,,,,,,0,1,Maison,99,4,S,sols,,,163,1.036353,42.99645
2020-93809,2020-06-04,000001,Vente,8550.4,,,LA COUME,B051,09160,09091,Cazavet,09,,,090910000A1004,,,,,,,,,,,,,0,,,,,P,prés,,,3900,1.058925,43.004586
2020-93809,2020-06-04,000001,Vente,8550.4,,,LA COUME,B051,09160,09091,Cazavet,09,,,090910000A1011,,,,,,,,,,,,,0,,,,,P,prés,,,4680,1.058152,43.004042
2020-93809,2020-06-04,000001,Vente,8550.4,,,LA COUME,B051,09160,09091,Cazavet,09,,,090910000A1012,,,,,,,,,,,,,0,,,,,P,prés,,,2161,1.058347,43.003568
2020-93809,2020-06-04,000001,Vente,8550.4,,,LA COUME,B051,09160,09091,Cazavet,09,,,090910000A1019,,,,,,,,,,,,,0,,,,,L,landes,,,10635,1.057787,43.003383
2020-94007,2020-06-15,000001,Vente,700,,,LABORIO,B090,09160,09091,Cazavet,09,,,090910000A1155,,,,,,,,,,,,,0,,,,,P,prés,,,1545,1.048322,43.00434
2020-94007,2020-06-15,000001,Vente,700,,,LABORIO,B090,09160,09091,Cazavet,09,,,090910000A1155,,,,,,,,,,,,,0,,,,,P,prés,,,6184,1.048322,43.00434
2020-94567,2020-08-05,000001,Vente,1500,,,GOUTE DE MIGOT,B076,09160,09091,Cazavet,09,,,090910000C0272,,,,,,,,,,,,,0,,,,,BS,taillis sous futaie,,,8955,1.024161,43.007474
2020-94567,2020-08-05,000001,Vente,1500,,,GOUTE DE MIGOT,B076,09160,09091,Cazavet,09,,,090910000C0273,,,,,,,,,,,,,0,,,,,L,landes,,,2286,1.025734,43.007062
2020-94567,2020-08-05,000001,Vente,1500,,,L HIDER,B083,09160,09091,Cazavet,09,,,090910000C0295,,,,,,,,,,,,,0,,,,,P,prés,,,8380,1.028645,43.011257
2020-94567,2020-08-05,000001,Vente,1500,,,L HIDER,B083,09160,09091,Cazavet,09,,,090910000C0296,,,,,,,,,,,,,0,,,,,BS,taillis sous futaie,,,1421,1.027985,43.011438
2020-94567,2020-08-05,000001,Vente,1500,,,LAS PLANOS,B105,09160,09091,Cazavet,09,,,090910000C0674,,,,,,,,,,,,,0,,,,,P,prés,,,2097,1.029505,43.009693
2020-94640,2020-07-31,000001,Vente,202970,,,BARTOILE,B012,09160,09091,Cazavet,09,,,090910000B0349,,,,,,,,,,,,,0,,,,,T,terres,,,1802,1.059915,42.996503
2020-94640,2020-07-31,000001,Vente,202970,5115,,BARTOILE,B012,09160,09091,Cazavet,09,,,090910000B0350,,,,,,,,,,,,,0,1,Maison,138,3,S,sols,,,528,1.060139,42.996601
2020-94640,2020-07-31,000001,Vente,202970,,,BARTOILE,B012,09160,09091,Cazavet,09,,,090910000B0351,,,,,,,,,,,,,0,,,,,S,sols,,,480,1.060201,42.996452
2020-94640,2020-07-31,000001,Vente,202970,,,BARTOILE,B012,09160,09091,Cazavet,09,,,090910000B1298,,,,,,,,,,,,,0,,,,,S,sols,,,160,1.060476,42.996267
2020-94640,2020-07-31,000001,Vente,202970,,,BARTOILE,B012,09160,09091,Cazavet,09,,,090910000B1299,,,,,,,,,,,,,0,,,,,L,landes,,,340,1.06034,42.996562
2020-94719,2020-08-07,000001,Vente,2000,,,CAZAUX VILLAGE,B036,09160,09091,Cazavet,09,,,090910000B0600,,,,,,,,,,,,,0,,,,,P,prés,,,2919,1.035209,42.994753
2020-94719,2020-08-07,000001,Vente,2000,,,CAZAUX VILLAGE,B036,09160,09091,Cazavet,09,,,090910000B0601,,,,,,,,,,,,,0,,,,,T,terres,,,2175,1.034754,42.994671
2020-95125,2020-09-24,000001,Vente,119900,5,,CHE DE ROUZET,0120,09160,09091,Cazavet,09,,,090910000A0843,,,,,,,,,,,,,0,1,Maison,59,4,S,sols,,,542,1.04681,43.005909
2020-95125,2020-09-24,000001,Vente,119900,5,,CHE DE ROUZET,0120,09160,09091,Cazavet,09,,,090910000A0843,,,,,,,,,,,,,0,1,Maison,59,4,L,landes,,,840,1.04681,43.005909
2020-95587,2020-10-23,000001,Vente,82000,18,,LA MAGINE,B112,09160,09091,Cazavet,09,,,090910000B0668,,,,,,,,,,,,,0,3,Dépendance,,0,S,sols,,,710,1.039333,42.998952
2020-95587,2020-10-23,000001,Vente,82000,18,,LA MAGINE,B112,09160,09091,Cazavet,09,,,090910000B0668,,,,,,,,,,,,,0,1,Maison,48,3,S,sols,,,710,1.039333,42.998952
2020-95593,2020-09-11,000001,Vente,3180,,,GOUTE DE MIGOT,B076,09160,09091,Cazavet,09,,,090910000C0272,,,,,,,,,,,,,0,,,,,BS,taillis sous futaie,,,8955,1.024161,43.007474
2020-95593,2020-09-11,000001,Vente,3180,,,GOUTE DE MIGOT,B076,09160,09091,Cazavet,09,,,090910000C0273,,,,,,,,,,,,,0,,,,,L,landes,,,2286,1.025734,43.007062
2020-95593,2020-09-11,000001,Vente,3180,,,L HIDER,B083,09160,09091,Cazavet,09,,,090910000C0295,,,,,,,,,,,,,0,,,,,P,prés,,,8380,1.028645,43.011257
2020-95593,2020-09-11,000001,Vente,3180,,,L HIDER,B083,09160,09091,Cazavet,09,,,090910000C0296,,,,,,,,,,,,,0,,,,,BS,taillis sous futaie,,,1421,1.027985,43.011438
2020-95593,2020-09-11,000001,Vente,3180,,,LAS PLANOS,B105,09160,09091,Cazavet,09,,,090910000C0674,,,,,,,,,,,,,0,,,,,P,prés,,,2097,1.029505,43.009693
