id_mutation,date_mutation,numero_disposition,nature_mutation,valeur_fonciere,adresse_numero,adresse_suffixe,adresse_nom_voie,adresse_code_voie,code_postal,code_commune,nom_commune,code_departement,ancien_code_commune,ancien_nom_commune,id_parcelle,ancien_id_parcelle,numero_volume,lot1_numero,lot1_surface_carrez,lot2_numero,lot2_surface_carrez,lot3_numero,lot3_surface_carrez,lot4_numero,lot4_surface_carrez,lot5_numero,lot5_surface_carrez,nombre_lots,code_type_local,type_local,surface_reelle_bati,nombre_pieces_principales,code_nature_culture,nature_culture,code_nature_culture_speciale,nature_culture_speciale,surface_terrain,longitude,latitude
2020-93448,2020-05-13,000001,Echange,500,,,CAMP DE LOURTET ET PORTETE,B016,09120,09173,Loubens,09,,,091730000A0846,,,,,,,,,,,,,0,,,,,L,landes,,,796,1.558517,43.049592
2020-93448,2020-05-13,000002,Echange,500,,,CAMP DE LOURTET ET PORTETE,B016,09120,09173,Loubens,09,,,091730000A0447,,,,,,,,,,,,,0,,,,,L,landes,,,440,1.561623,43.049578
2020-93448,2020-05-13,000002,Echange,500,,,CAMP DE LOURTET ET PORTETE,B016,09120,09173,Loubens,09,,,091730000A0841,,,,,,,,,,,,,0,,,,,BT,taillis simples,,,836,1.561038,43.049541
2020-93448,2020-05-13,000002,Echange,500,,,CAMP DE LOURTET ET PORTETE,B016,09120,09173,Loubens,09,,,091730000A0843,,,,,,,,,,,,,0,,,,,BT,taillis simples,,,1709,1.561467,43.049452
2020-94152,2020-06-17,000001,Vente,115000,,,MARQUET,B044,09120,09173,Loubens,09,,,091730000B0473,,,,,,,,,,,,,0,,,,,BT,taillis simples,,,2060,1.562709,43.03711
2020-94152,2020-06-17,000001,Vente,115000,,,GOUTE ET JORDY,B036,09120,09173,Loubens,09,,,091730000B0666,,,,,,,,,,,,,0,,,,,P,prés,,,10560,1.556674,43.033185
2020-94152,2020-06-17,000001,Vente,115000,,,GOUTE ET JORDY,B036,09120,09173,Loubens,09,,,091730000B0667,,,,,,,,,,,,,0,,,,,P,prés,,,2560,1.556094,43.03271
2020-94152,2020-06-17,000001,Vente,115000,,,GOUTE ET JORDY,B036,09120,09173,Loubens,09,,,091730000B0668,,,,,,,,,,,,,0,,,,,P,prés,,,370,1.555906,43.032279
2020-94152,2020-06-17,000001,Vente,115000,,,GOUTE ET JORDY,B036,09120,09173,Loubens,09,,,091730000B0669,,,,,,,,,,,,,0,,,,,P,prés,,,550,1.556162,43.032247
2020-94152,2020-06-17,000001,Vente,115000,64,,GOUTE ET JORDY,B036,09120,09173,Loubens,09,,,091730000B0670,,,,,,,,,,,,,0,1,Maison,120,5,S,sols,,,675,1.556522,43.032174
2020-94152,2020-06-17,000001,Vente,115000,,,DEBEZ,B029,09120,09173,Loubens,09,,,091730000B0965,,,,,,,,,,,,,0,,,,,BS,taillis sous futaie,,,10960,1.543793,43.03194
2020-94690,2020-08-07,000001,Vente,100000,,,ROC DE COULOUM,B061,09120,09173,Loubens,09,,,091730000B1665,,,,,,,,,,,,,0,,,,,AG,terrains d'agrément,,,159,1.540954,43.041459
2020-94690,2020-08-07,000001,Vente,100000,5005,,ROC DE COULOUM,B061,09120,09173,Loubens,09,,,091730000B1668,,,,,,,,,,,,,0,1,Maison,133,5,S,sols,,,725,1.54161,43.041195
2020-94690,2020-08-07,000001,Vente,100000,,,ROC DE COULOUM,B061,09120,09173,Loubens,09,,,091730000B1669,,,,,,,,,,,,,0,,,,,S,sols,,,94,1.541534,43.041288
2020-94690,2020-08-07,000001,Vente,100000,,,ROC DE COULOUM,B061,09120,09173,Loubens,09,,,091730000B1672,,,,,,,,,,,,,0,,,,,AG,terrains d'agrément,,,979,1.541405,43.041345
2020-94993,2020-09-11,000001,Vente,40000,31,,LOUBENS,B041,09120,09173,Loubens,09,,,091730000B0143,,,,,,,,,,,,,0,2,Appartement,70,3,S,sols,,,305,1.545716,43.045067
2020-94993,2020-09-11,000001,Vente,40000,31,,LOUBENS,B041,09120,09173,Loubens,09,,,091730000B0143,,,,,,,,,,,,,0,2,Appartement,66,4,S,sols,,,305,1.545716,43.045067
2020-94993,2020-09-11,000001,Vente,40000,31,,LOUBENS,B041,09120,09173,Loubens,09,,,091730000B0143,,,,,,,,,,,,,0,3,Dépendance,,0,S,sols,,,305,1.545716,43.045067
2020-94993,2020-09-11,000001,Vente,40000,,,LOUBENS,B041,09120,09173,Loubens,09,,,091730000B0144,,,,,,,,,,,,,0,,,,,J,jardins,,,286,1.545552,43.045001
2020-95590,2020-10-17,000001,Vente,592,,,PERIE,B047,09120,09173,Loubens,09,,,091730000A0383,,,,,,,,,,,,,0,,,,,BT,taillis simples,,,1480,1.568397,43.043639
2020-95917,2020-11-13,000001,Vente,6000,,,PICBERT,B050,09120,09173,Loubens,09,,,091730000B0465,,,,,,,,,,,,,0,,,,,BT,taillis simples,,,380,1.566595,43.033295
2020-95917,2020-11-13,000001,Vente,6000,,,PICBERT,B050,09120,09173,Loubens,09,,,091730000B0466,,,,,,,,,,,,,0,,,,,T,terres,,,1640,1.566215,43.033294
2020-95917,2020-11-13,000001,Vente,6000,,,PICBERT,B050,09120,09173,Loubens,09,,,091730000B0467,,,,,,,,,,,,,0,,,,,BT,taillis simples,,,1500,1.565909,43.033307
2020-95917,2020-11-13,000001,Vente,6000,,,GOUTE ET JORDY,B036,09120,09173,Loubens,09,,,091730000B0767,,,,,,,,,,,,,0,,,,,T,terres,,,9600,1.564977,43.032019
2020-95917,2020-11-13,000001,Vente,6000,,,GOUTE ET JORDY,B036,09120,09173,Loubens,09,,,091730000B0768,,,,,,,,,,,,,0,,,,,T,terres,,,8665,1.566248,43.032476
2020-95917,2020-11-13,000001,Vente,6000,,,GOUTE ET JORDY,B036,09120,09173,Loubens,09,,,091730000B0769,,,,,,,,,,,,,0,,,,,P,prés,,,8045,1.565926,43.031172
2020-96384,2020-12-02,000001,Vente,500000,,,LA PRADE,B055,09120,09173,Loubens,09,,,091730000B0096,,,,,,,,,,,,,0,,,,,T,terres,,,5545,1.543025,43.043023
2020-96384,2020-12-02,000001,Vente,500000,,,LA PRADE,B055,09120,09173,Loubens,09,,,091730000B0098,,,,,,,,,,,,,0,,,,,T,terres,,,12700,1.545047,43.043823
2020-96384,2020-12-02,000001,Vente,500000,24,,LA PRADE,B055,09120,09173,Loubens,09,,,091730000B0099,,,,,,,,,,,,,0,1,Maison,359,7,S,sols,,,4257,1.544509,43.04319
2020-96384,2020-12-02,000001,Vente,500000,,,LA PRADE,B055,09120,09173,Loubens,09,,,091730000B0100,,,,,,,,,,,,,0,,,,,P,prés,,,4012,1.545806,43.042343
2020-96384,2020-12-02,000001,Vente,500000,,,LA PRADE,B055,09120,09173,Loubens,09,,,091730000B0101,,,,,,,,,,,,,0,,,,,P,prés,,,950,1.545989,43.04253
2020-96384,2020-12-02,000001,Vente,500000,,,LA PRADE,B055,09120,09173,Loubens,09,,,091730000B0103,,,,,,,,,,,,,0,,,,,S,sols,,,1735,1.545746,43.043817
2020-96384,2020-12-02,000001,Vente,500000,,,LA CAIRE,B014,09120,09173,Loubens,09,,,091730000B1197,,,,,,,,,,,,,0,,,,,BS,taillis sous futaie,,,22900,1.532873,43.033408
2020-96384,2020-12-02,000001,Vente,500000,,,LE QUIE,B057,09120,09173,Loubens,09,,,091730000B1206,,,,,,,,,,,,,0,,,,,BS,taillis sous futaie,,,22000,1.529086,43.035177
2020-96384,2020-12-02,000001,Vente,500000,,,LA PRADE,B055,09120,09173,Loubens,09,,,091730000B1445,,,,,,,,,,,,,0,,,,,P,prés,,,16038,1.544725,43.04259
2020-96384,2020-12-02,000001,Vente,500000,,,LA PRADE,B055,09120,09173,Loubens,09,,,091730000B1448,,,,,,,,,,,,,0,,,,,P,prés,,,5634,1.543663,43.042851
2020-96384,2020-12-02,000001,Vente,500000,,,LA PRADE,B055,09120,09173,Loubens,09,,,091730000B1450,,,,,,,,,,,,,0,,,,,T,terres,,,4554,1.543299,43.043674
2020-96384,2020-12-02,000001,Vente,500000,,,LA PRADE,B055,09120,09173,Loubens,09,,,091730000B1529,,,,,,,,,,,,,0,,,,,T,terres,,,8901,1.546245,43.043387
2020-96384,2020-12-02,000001,Vente,500000,,,LA PRADE,B055,09120,09173,Loubens,09,,,091730000B1529,,,,,,,,,,,,,0,,,,,S,sols,,,362,1.546245,43.043387
2020-96384,2020-12-02,000001,Vente,500000,,,LA PRADE,B055,09120,09173,Loubens,09,,,091730000B1530,,,,,,,,,,,,,0,,,,,T,terres,,,102,1.545874,43.044041
2020-96384,2020-12-02,000001,Vente,500000,,,LA PRADE,B055,09120,09173,Loubens,09,,,091730000B1630,,,,,,,,,,,,,0,,,,,T,terres,,,188,1.545512,43.043753
