id_mutation,date_mutation,numero_disposition,nature_mutation,valeur_fonciere,adresse_numero,adresse_suffixe,adresse_nom_voie,adresse_code_voie,code_postal,code_commune,nom_commune,code_departement,ancien_code_commune,ancien_nom_commune,id_parcelle,ancien_id_parcelle,numero_volume,lot1_numero,lot1_surface_carrez,lot2_numero,lot2_surface_carrez,lot3_numero,lot3_surface_carrez,lot4_numero,lot4_surface_carrez,lot5_numero,lot5_surface_carrez,nombre_lots,code_type_local,type_local,surface_reelle_bati,nombre_pieces_principales,code_nature_culture,nature_culture,code_nature_culture_speciale,nature_culture_speciale,surface_terrain,longitude,latitude
2020-92957,2020-02-25,000001,Vente,45000,,,CLOT LAOURAT,B007,09230,09190,Mérigon,09,,,091900000A0014,,,,,,,,,,,,,0,,,,,P,prés,,,2980,1.211009,43.104295
2020-92957,2020-02-25,000001,Vente,45000,1,,CLOT LAOURAT,B007,09230,09190,Mérigon,09,,,091900000A0015,,,,,,,,,,,,,0,1,Maison,45,2,S,sols,,,803,1.211524,43.104185
2020-92957,2020-02-25,000001,Vente,45000,,,CLOT LAOURAT,B007,09230,09190,Mérigon,09,,,091900000A0016,,,,,,,,,,,,,0,,,,,P,prés,,,500,1.210684,43.104212
2020-94205,2020-07-03,000001,Vente,28000,,,LE BOUSQUAROT,B002,09230,09190,Mérigon,09,,,091900000A1880,,,,,,,,,,,,,0,,,,,T,terres,,,2580,1.201211,43.086569
2020-95082,2020-09-10,000001,Vente,35000,,,VILLAGE,B025,09230,09190,Mérigon,09,,,091900000A1804,,,,,,,,,,,,,0,,,,,BT,taillis simples,,,55,1.192221,43.088389
2020-95082,2020-09-10,000001,Vente,35000,,,VILLAGE,B025,09230,09190,Mérigon,09,,,091900000A1805,,,,,,,,,,,,,0,,,,,L,landes,,,50,1.192325,43.08839
2020-95082,2020-09-10,000001,Vente,35000,34,,VILLAGE,B025,09230,09190,Mérigon,09,,,091900000A1809,,,,,,,,,,,,,0,1,Maison,90,5,S,sols,,,289,1.192427,43.088085
2020-95082,2020-09-10,000001,Vente,35000,,,VILLAGE,B025,09230,09190,Mérigon,09,,,091900000A1810,,,,,,,,,,,,,0,,,,,BT,taillis simples,,,165,1.192272,43.088204
2020-95082,2020-09-10,000001,Vente,35000,,,VILLAGE,B025,09230,09190,Mérigon,09,,,091900000A1811,,,,,,,,,,,,,0,,,,,S,sols,,,348,1.192397,43.087987
2020-95082,2020-09-10,000001,Vente,35000,,,VILLAGE,B025,09230,09190,Mérigon,09,,,091900000A1813,,,,,,,,,,,,,0,,,,,S,sols,,,85,1.192489,43.087813
2020-95082,2020-09-10,000001,Vente,35000,,,VILLAGE,B025,09230,09190,Mérigon,09,,,091900000A1814,,,,,,,,,,,,,0,,,,,S,sols,,,143,1.192332,43.087859
2020-95082,2020-09-10,000001,Vente,35000,,,VILLAGE,B025,09230,09190,Mérigon,09,,,091900000A1815,,,,,,,,,,,,,0,,,,,BP,peupleraies,,,1315,1.192087,43.087711
2020-95082,2020-09-10,000001,Vente,35000,,,VILLAGE,B025,09230,09190,Mérigon,09,,,091900000A1816,,,,,,,,,,,,,0,,,,,BP,peupleraies,,,1080,1.191978,43.087089
2020-95082,2020-09-10,000001,Vente,35000,,,VILLAGE,B025,09230,09190,Mérigon,09,,,091900000A1817,,,,,,,,,,,,,0,,,,,BP,peupleraies,,,1010,1.192317,43.087469
2020-95082,2020-09-10,000001,Vente,35000,,,VILLAGE,B025,09230,09190,Mérigon,09,,,091900000A2132,,,,,,,,,,,,,0,,,,,BP,peupleraies,,,440,1.19222,43.087571
2020-95082,2020-09-10,000001,Vente,35000,,,VILLAGE,B025,09230,09190,Mérigon,09,,,091900000A2165,,,,,,,,,,,,,0,,,,,S,sols,,,107,1.192507,43.087877
2020-95082,2020-09-10,000001,Vente,35000,,,LA PRADE,B033,09230,09190,Mérigon,09,,,091900000B0228,,,,,,,,,,,,,0,,,,,P,prés,,,220,1.192,43.08894
2020-95082,2020-09-10,000001,Vente,35000,,,LE PEYRE ET LAS MURAILLES,B029,09230,09190,Mérigon,09,,,091900000B0230,,,,,,,,,,,,,0,,,,,BT,taillis simples,,,320,1.19101,43.089595
2020-95082,2020-09-10,000001,Vente,35000,,,LE JUNCAIL ET LA ROQUE,B019,09230,09190,Mérigon,09,,,091900000B0314,,,,,,,,,,,,,0,,,,,BT,taillis simples,,,1455,1.191091,43.08943
2020-95082,2020-09-10,000001,Vente,35000,,,LE JUNCAIL ET LA ROQUE,B019,09230,09190,Mérigon,09,,,091900000B0316,,,,,,,,,,,,,0,,,,,P,prés,,,1020,1.191826,43.088925
