id_mutation,date_mutation,numero_disposition,nature_mutation,valeur_fonciere,adresse_numero,adresse_suffixe,adresse_nom_voie,adresse_code_voie,code_postal,code_commune,nom_commune,code_departement,ancien_code_commune,ancien_nom_commune,id_parcelle,ancien_id_parcelle,numero_volume,lot1_numero,lot1_surface_carrez,lot2_numero,lot2_surface_carrez,lot3_numero,lot3_surface_carrez,lot4_numero,lot4_surface_carrez,lot5_numero,lot5_surface_carrez,nombre_lots,code_type_local,type_local,surface_reelle_bati,nombre_pieces_principales,code_nature_culture,nature_culture,code_nature_culture_speciale,nature_culture_speciale,surface_terrain,longitude,latitude
2020-92214,2020-01-10,000001,Vente,69000,240,,VILLAGE,B077,09460,09239,Quérigut,09,,,092390000A4483,,,,,,,,,,,,,0,1,Maison,40,3,S,sols,,,36,2.096477,42.698864
2020-92235,2020-01-23,000001,Vente,700,,,PIJOL,B056,09460,09239,Quérigut,09,,,092390000A0865,,,,,,,,,,,,,0,,,,,P,prés,,,2270,2.101576,42.700773
2020-92393,2020-01-20,000001,Vente,138000,267,,POUNTET ET COUILLET,B063,09460,09239,Quérigut,09,,,092390000A0982,,,,,,,,,,,,,0,1,Maison,90,4,P,prés,,,957,2.096927,42.697016
2020-92393,2020-01-20,000001,Vente,138000,267,,POUNTET ET COUILLET,B063,09460,09239,Quérigut,09,,,092390000A0982,,,,,,,,,,,,,0,1,Maison,90,4,S,sols,,,425,2.096927,42.697016
2020-92401,2020-02-11,000001,Vente,35000,17,,VILLAGE,B077,09460,09239,Quérigut,09,,,092390000A0363,,,,,,,,,,,,,0,1,Maison,105,7,S,sols,,,237,2.099208,42.699591
2020-92401,2020-02-11,000001,Vente,35000,,,VILLAGE,B077,09460,09239,Quérigut,09,,,092390000A0364,,,,,,,,,,,,,0,,,,,S,sols,,,225,2.099041,42.699594
2020-93197,2020-03-30,000002,Vente,64,,,VILLAGE,B077,09460,09239,Quérigut,09,,,092390000A4972,,,,,,,,,,,,,0,,,,,S,sols,,,15,2.098488,42.699059
2020-93197,2020-03-30,000002,Vente,64,,,VILLAGE,B077,09460,09239,Quérigut,09,,,092390000A4973,,,,,,,,,,,,,0,,,,,S,sols,,,3,2.098514,42.699054
2020-93197,2020-03-30,000002,Vente,64,,,VILLAGE,B077,09460,09239,Quérigut,09,,,092390000A4974,,,,,,,,,,,,,0,,,,,S,sols,,,14,2.098586,42.699097
2020-93664,2020-06-10,000001,Vente,56000,110,,VILLAGE,B077,09460,09239,Quérigut,09,,,092390000A4979,,,,,,,,,,,,,0,1,Maison,50,4,S,sols,,,50,2.096501,42.698136
2020-93664,2020-06-10,000001,Vente,56000,,,VILLAGE,B077,09460,09239,Quérigut,09,,,092390000A4981,,,,,,,,,,,,,0,,,,,S,sols,,,31,2.09651,42.698103
2020-94540,2020-07-30,000001,Vente,125500,,,LE MAS,B047,09460,09239,Quérigut,09,,,092390000B0357,,,,,,,,,,,,,0,,,,,J,jardins,,,241,2.09126,42.702613
2020-94540,2020-07-30,000001,Vente,125500,228,,LE MAS,B047,09460,09239,Quérigut,09,,,092390000B0358,,,,,,,,,,,,,0,1,Maison,60,3,S,sols,,,166,2.091139,42.702557
2020-94540,2020-07-30,000001,Vente,125500,,,LE MAS,B047,09460,09239,Quérigut,09,,,092390000B0359,,,,,,,,,,,,,0,,,,,S,sols,,,175,2.091054,42.702446
2020-94540,2020-07-30,000001,Vente,125500,,,LE MAS,B047,09460,09239,Quérigut,09,,,092390000B1665,,,,,,,,,,,,,0,,,,,S,sols,,,26,2.091071,42.702639
2020-94540,2020-07-30,000001,Vente,125500,,,LE MAS,B047,09460,09239,Quérigut,09,,,092390000B1666,,,,,,,,,,,,,0,,,,,S,sols,,,65,2.091007,42.70257
2020-94540,2020-07-30,000001,Vente,125500,,,LE MAS,B047,09460,09239,Quérigut,09,,,092390000B1667,,,,,,,,,,,,,0,,,,,S,sols,,,9,2.091043,42.70255
2020-94564,2020-08-07,000001,Vente,161500,,,PIJOL,B056,09460,09239,Quérigut,09,,,092390000A0871,,,,,,,,,,,,,0,,,,,BR,futaies résineuses,,,3380,2.101856,42.699704
2020-94564,2020-08-07,000001,Vente,161500,,,PIJOL,B056,09460,09239,Quérigut,09,,,092390000A0874,,,,,,,,,,,,,0,,,,,T,terres,,,926,2.101319,42.699612
2020-94564,2020-08-07,000001,Vente,161500,184,,PIJOL,B056,09460,09239,Quérigut,09,,,092390000A0875,,,,,,,,,,,,,0,1,Maison,137,7,P,prés,,,625,2.101851,42.699273
2020-94564,2020-08-07,000001,Vente,161500,184,,PIJOL,B056,09460,09239,Quérigut,09,,,092390000A0875,,,,,,,,,,,,,0,1,Maison,137,7,S,sols,,,472,2.101851,42.699273
2020-94564,2020-08-07,000001,Vente,161500,,,PIJOL,B056,09460,09239,Quérigut,09,,,092390000A0883,,,,,,,,,,,,,0,,,,,AB,terrains a bâtir,,,650,2.101628,42.699195
2020-94564,2020-08-07,000001,Vente,161500,,,PIJOL,B056,09460,09239,Quérigut,09,,,092390000A0884,,,,,,,,,,,,,0,,,,,AB,terrains a bâtir,,,658,2.101185,42.699451
2020-94896,2020-09-09,000001,Vente,220000,,,PALMES ET CAMBAYNOU,B051,09460,09239,Quérigut,09,,,092390000A0211,,,,,,,,,,,,,0,,,,,T,terres,,,586,2.099888,42.70097
2020-94896,2020-09-09,000001,Vente,220000,,,PALMES ET CAMBAYNOU,B051,09460,09239,Quérigut,09,,,092390000A0212,,,,,,,,,,,,,0,,,,,T,terres,,,1041,2.099674,42.701001
2020-94896,2020-09-09,000001,Vente,220000,,,PALMES ET CAMBAYNOU,B051,09460,09239,Quérigut,09,,,092390000A4439,,,,,,,,,,,,,0,,,,,AG,terrains d'agrément,,,511,2.099356,42.700692
2020-94896,2020-09-09,000001,Vente,220000,,,PALMES ET CAMBAYNOU,B051,09460,09239,Quérigut,09,,,092390000A4439,,,,,,,,,,,,,0,,,,,S,sols,,,45,2.099356,42.700692
2020-94896,2020-09-09,000001,Vente,220000,,,PALMES ET CAMBAYNOU,B051,09460,09239,Quérigut,09,,,092390000A4749,,,,,,,,,,,,,0,,,,,T,terres,,,511,2.100014,42.700892
2020-94896,2020-09-09,000001,Vente,220000,183,A,PALMES ET CAMBAYNOU,B051,09460,09239,Quérigut,09,,,092390000A4757,,,,,,,,,,,,,0,1,Maison,111,4,S,sols,,,509,2.099251,42.700519
2020-94966,2020-09-02,000001,Vente,85000,226,,LE MAS,B047,09460,09239,Quérigut,09,,,092390000B1664,,,,,,,,,,,,,0,1,Maison,67,3,S,sols,,,80,2.090988,42.702666
2020-94966,2020-09-02,000001,Vente,85000,,,LE MAS,B047,09460,09239,Quérigut,09,,,092390000B1666,,,,,,,,,,,,,0,,,,,S,sols,,,65,2.091007,42.70257
2020-95495,2020-09-24,000001,Vente,20000,5001,,PLAMBOUYE,B058,09460,09239,Quérigut,09,,,092390000A2847,,,,,,,,,,,,,0,4,Local industriel. commercial ou assimilé,,,L,landes,,,404,2.113906,42.688273
2020-95495,2020-09-24,000001,Vente,20000,,,PLAMBOUYE,B058,09460,09239,Quérigut,09,,,092390000A2874,,,,,,,,,,,,,0,,,,,L,landes,,,2010,2.113909,42.690691
2020-95495,2020-09-24,000001,Vente,20000,,,LES PLANES,B061,09460,09239,Quérigut,09,,,092390000A2919,,,,,,,,,,,,,0,,,,,L,landes,,,2007,2.112838,42.687668
2020-95495,2020-09-24,000001,Vente,20000,,,LES PLANES,B061,09460,09239,Quérigut,09,,,092390000A2922,,,,,,,,,,,,,0,,,,,L,landes,,,4490,2.113037,42.686999
2020-95495,2020-09-24,000001,Vente,20000,,,LES PLANES,B061,09460,09239,Quérigut,09,,,092390000A2933,,,,,,,,,,,,,0,,,,,L,landes,,,145,2.112622,42.683863
2020-95495,2020-09-24,000001,Vente,20000,,,LES PLANES,B061,09460,09239,Quérigut,09,,,092390000A2945,,,,,,,,,,,,,0,,,,,L,landes,,,4250,2.112322,42.68568
2020-95495,2020-09-24,000001,Vente,20000,,,LES PLANES,B061,09460,09239,Quérigut,09,,,092390000A2946,,,,,,,,,,,,,0,,,,,L,landes,,,2280,2.11165,42.686003
2020-95495,2020-09-24,000001,Vente,20000,,,LES PLANES,B061,09460,09239,Quérigut,09,,,092390000A2961,,,,,,,,,,,,,0,,,,,P,prés,,,1622,2.106622,42.686544
2020-95495,2020-09-24,000001,Vente,20000,,,LES PLANES,B061,09460,09239,Quérigut,09,,,092390000A2970,,,,,,,,,,,,,0,,,,,L,landes,,,2510,2.107748,42.68678
2020-95495,2020-09-24,000001,Vente,20000,,,LES PLANES,B061,09460,09239,Quérigut,09,,,092390000A2972,,,,,,,,,,,,,0,,,,,L,landes,,,2501,2.108409,42.687448
2020-95495,2020-09-24,000001,Vente,20000,,,LES PLANES,B061,09460,09239,Quérigut,09,,,092390000A2973,,,,,,,,,,,,,0,,,,,L,landes,,,666,2.108697,42.687605
2020-95495,2020-09-24,000001,Vente,20000,,,LES PLANES,B061,09460,09239,Quérigut,09,,,092390000A2974,,,,,,,,,,,,,0,,,,,L,landes,,,1640,2.108713,42.687257
2020-95495,2020-09-24,000001,Vente,20000,,,LES PLANES,B061,09460,09239,Quérigut,09,,,092390000A2980,,,,,,,,,,,,,0,,,,,L,landes,,,2795,2.109299,42.686816
2020-95495,2020-09-24,000001,Vente,20000,,,LES PLANES,B061,09460,09239,Quérigut,09,,,092390000A2982,,,,,,,,,,,,,0,,,,,L,landes,,,2010,2.109997,42.686523
2020-95495,2020-09-24,000001,Vente,20000,,,LES PLANES,B061,09460,09239,Quérigut,09,,,092390000A2988,,,,,,,,,,,,,0,,,,,L,landes,,,855,2.111728,42.686302
2020-95495,2020-09-24,000001,Vente,20000,,,LES PLANES,B061,09460,09239,Quérigut,09,,,092390000A2989,,,,,,,,,,,,,0,,,,,L,landes,,,1454,2.111699,42.686575
2020-95495,2020-09-24,000001,Vente,20000,,,LES PLANES,B061,09460,09239,Quérigut,09,,,092390000A2990,,,,,,,,,,,,,0,,,,,L,landes,,,1613,2.111705,42.686878
2020-95495,2020-09-24,000001,Vente,20000,,,LES PLANES,B061,09460,09239,Quérigut,09,,,092390000A2992,,,,,,,,,,,,,0,,,,,L,landes,,,2860,2.111079,42.686694
2020-95495,2020-09-24,000001,Vente,20000,,,LES PLANES,B061,09460,09239,Quérigut,09,,,092390000A2994,,,,,,,,,,,,,0,,,,,L,landes,,,1380,2.111131,42.68716
2020-95495,2020-09-24,000001,Vente,20000,,,LES PLANES,B061,09460,09239,Quérigut,09,,,092390000A2997,,,,,,,,,,,,,0,,,,,L,landes,,,823,2.110205,42.687573
2020-95495,2020-09-24,000001,Vente,20000,,,LES PLANES,B061,09460,09239,Quérigut,09,,,092390000A2998,,,,,,,,,,,,,0,,,,,L,landes,,,270,2.110105,42.687489
2020-95495,2020-09-24,000001,Vente,20000,,,GALINIERE,B036,09460,09239,Quérigut,09,,,092390000A3281,,,,,,,,,,,,,0,,,,,L,landes,,,2090,2.122354,42.690583
2020-95495,2020-09-24,000001,Vente,20000,,,GALINIERE,B036,09460,09239,Quérigut,09,,,092390000A3282,,,,,,,,,,,,,0,,,,,L,landes,,,2251,2.121919,42.690409
2020-95495,2020-09-24,000001,Vente,20000,,,GALINIERE,B036,09460,09239,Quérigut,09,,,092390000A3284,,,,,,,,,,,,,0,,,,,L,landes,,,1150,2.121665,42.690242
2020-95495,2020-09-24,000001,Vente,20000,,,GALINIERE,B036,09460,09239,Quérigut,09,,,092390000A3285,,,,,,,,,,,,,0,,,,,L,landes,,,2361,2.121442,42.690041
2020-95495,2020-09-24,000001,Vente,20000,,,GALINIERE,B036,09460,09239,Quérigut,09,,,092390000A3294,,,,,,,,,,,,,0,,,,,L,landes,,,4850,2.120742,42.689835
2020-95495,2020-09-24,000001,Vente,20000,,,GALINIERE,B036,09460,09239,Quérigut,09,,,092390000A3320,,,,,,,,,,,,,0,,,,,L,landes,,,3068,2.120391,42.689255
2020-95495,2020-09-24,000001,Vente,20000,,,GALINIERE,B036,09460,09239,Quérigut,09,,,092390000A3323,,,,,,,,,,,,,0,,,,,L,landes,,,1985,2.120564,42.689343
2020-95495,2020-09-24,000001,Vente,20000,,,GALINIERE,B036,09460,09239,Quérigut,09,,,092390000A3324,,,,,,,,,,,,,0,,,,,L,landes,,,4200,2.12128,42.689645
2020-95495,2020-09-24,000001,Vente,20000,,,GALINIERE,B036,09460,09239,Quérigut,09,,,092390000A3325,,,,,,,,,,,,,0,,,,,L,landes,,,510,2.121741,42.689549
2020-95495,2020-09-24,000001,Vente,20000,,,GALINIERE,B036,09460,09239,Quérigut,09,,,092390000A3326,,,,,,,,,,,,,0,,,,,L,landes,,,1134,2.122052,42.689441
2020-95495,2020-09-24,000001,Vente,20000,,,GALINIERE,B036,09460,09239,Quérigut,09,,,092390000A3327,,,,,,,,,,,,,0,,,,,L,landes,,,2105,2.122126,42.689315
2020-95495,2020-09-24,000001,Vente,20000,,,GALINIERE,B036,09460,09239,Quérigut,09,,,092390000A3328,,,,,,,,,,,,,0,,,,,L,landes,,,2520,2.12206,42.689871
2020-95495,2020-09-24,000001,Vente,20000,,,GALINIERE,B036,09460,09239,Quérigut,09,,,092390000A3329,,,,,,,,,,,,,0,,,,,L,landes,,,1810,2.122629,42.690022
2020-95495,2020-09-24,000001,Vente,20000,,,CARDAILLOUS DU SINGLA,B020,09460,09239,Quérigut,09,,,092390000A3343,,,,,,,,,,,,,0,,,,,L,landes,,,1539,2.126487,42.689873
2020-95495,2020-09-24,000001,Vente,20000,,,CARDAILLOUS DU SINGLA,B020,09460,09239,Quérigut,09,,,092390000A3344,,,,,,,,,,,,,0,,,,,L,landes,,,2335,2.127226,42.689449
2020-95495,2020-09-24,000001,Vente,20000,,,CARDAILLOUS DU SINGLA,B020,09460,09239,Quérigut,09,,,092390000A3345,,,,,,,,,,,,,0,,,,,L,landes,,,566,2.12739,42.689626
2020-95495,2020-09-24,000001,Vente,20000,,,CARDAILLOUS DU SINGLA,B020,09460,09239,Quérigut,09,,,092390000A3353,,,,,,,,,,,,,0,,,,,L,landes,,,3054,2.128165,42.690035
2020-95495,2020-09-24,000001,Vente,20000,,,BOIS COMMUNAL ENCORP ET FU,B008,09460,09239,Quérigut,09,,,092390000A3500,,,,,,,,,,,,,0,,,,,L,landes,,,705,2.127474,42.689193
2020-95495,2020-09-24,000001,Vente,20000,,,BOIS COMMUNAL ENCORP ET FU,B008,09460,09239,Quérigut,09,,,092390000A3503,,,,,,,,,,,,,0,,,,,L,landes,,,796,2.127317,42.689037
2020-95495,2020-09-24,000001,Vente,20000,,,BOIS COMMUNAL ENCORP ET FU,B008,09460,09239,Quérigut,09,,,092390000A3504,,,,,,,,,,,,,0,,,,,L,landes,,,964,2.127135,42.68888
2020-95495,2020-09-24,000001,Vente,20000,,,BOIS COMMUNAL ENCORP ET FU,B008,09460,09239,Quérigut,09,,,092390000A3505,,,,,,,,,,,,,0,,,,,BT,taillis simples,,,520,2.126821,42.688982
2020-95495,2020-09-24,000001,Vente,20000,,,BOIS COMMUNAL ENCORP ET FU,B008,09460,09239,Quérigut,09,,,092390000A3517,,,,,,,,,,,,,0,,,,,L,landes,,,1395,2.122457,42.689148
2020-95495,2020-09-24,000001,Vente,20000,,,CAPELIER,B017,09460,09239,Quérigut,09,,,092390000A4295,,,,,,,,,,,,,0,,,,,L,landes,,,470,2.141728,42.69381
2020-95495,2020-09-24,000001,Vente,20000,,,CAPELIER,B017,09460,09239,Quérigut,09,,,092390000A4303,,,,,,,,,,,,,0,,,,,L,landes,,,2800,2.143401,42.692254
2020-95495,2020-09-24,000001,Vente,20000,,,CAPELIER,B017,09460,09239,Quérigut,09,,,092390000A4305,,,,,,,,,,,,,0,,,,,L,landes,,,2460,2.144037,42.692389
2020-95495,2020-09-24,000001,Vente,20000,,,CAPELIER,B017,09460,09239,Quérigut,09,,,092390000A4319,,,,,,,,,,,,,0,,,,,L,landes,,,1800,2.144384,42.693962
2020-95495,2020-09-24,000001,Vente,20000,,,CAPELIER,B017,09460,09239,Quérigut,09,,,092390000A4451,,,,,,,,,,,,,0,,,,,L,landes,,,7926,2.144392,42.693493
2020-95495,2020-09-24,000001,Vente,20000,,,LES PLANES,B061,09460,09239,Quérigut,09,,,092390000A4952,,,,,,,,,,,,,0,,,,,L,landes,,,974,2.107345,42.686876
2020-95646,2020-10-15,000001,Vente,58000,,,LE MAS,B047,09460,09239,Quérigut,09,,,092390000B0330,,,,,,,,,,,,,0,,,,,T,terres,,,745,2.091023,42.704447
2020-95646,2020-10-15,000001,Vente,58000,273,,LE MAS,B047,09460,09239,Quérigut,09,,,092390000B0332,,,,,,,,,,,,,0,1,Maison,50,3,S,sols,,,87,2.091047,42.704377
2020-96022,2020-11-16,000001,Vente,5000,,,VILLAGE,B077,09460,09239,Quérigut,09,,,092390000A4427,,,,,,,,,,,,,0,,,,,S,sols,,,49,2.098111,42.69954
2020-96096,2020-11-23,000001,Vente,20000,1,,VILLAGE,B077,09460,09239,Quérigut,09,,,092390000A0306,,,,,,,,,,,,,0,1,Maison,30,2,S,sols,,,88,2.099556,42.699799
2020-96394,2020-12-08,000001,Vente,67750,109,,VILLAGE,B077,09460,09239,Quérigut,09,,,092390000A0798,,,,,,,,,,,,,0,1,Maison,46,3,S,sols,,,34,2.096548,42.698193
2020-96570,2020-12-22,000001,Vente,238000,,,FUMAS,B035,09460,09239,Quérigut,09,,,092390000A4881,,,,,,,,,,,,,0,,,,,BT,taillis simples,,,270,2.124396,42.682727
2020-96570,2020-12-22,000001,Vente,238000,261,,CABANAS PRE DE MARTY,B013,09460,09239,Quérigut,09,,,092390000A4957,,,,,,,,,,,,,0,1,Maison,140,4,S,sols,,,1721,2.124134,42.682831
2020-96816,2020-12-24,000001,Vente,112000,,,ABADES,B002,09460,09239,Quérigut,09,,,092390000A3253,,,,,,,,,,,,,0,,,,,L,landes,,,1334,2.100624,42.69579
2020-96816,2020-12-24,000001,Vente,112000,,,ABADES,B002,09460,09239,Quérigut,09,,,092390000A4512,,,,,,,,,,,,,0,,,,,L,landes,,,4478,2.101017,42.695964
