id_mutation,date_mutation,numero_disposition,nature_mutation,valeur_fonciere,adresse_numero,adresse_suffixe,adresse_nom_voie,adresse_code_voie,code_postal,code_commune,nom_commune,code_departement,ancien_code_commune,ancien_nom_commune,id_parcelle,ancien_id_parcelle,numero_volume,lot1_numero,lot1_surface_carrez,lot2_numero,lot2_surface_carrez,lot3_numero,lot3_surface_carrez,lot4_numero,lot4_surface_carrez,lot5_numero,lot5_surface_carrez,nombre_lots,code_type_local,type_local,surface_reelle_bati,nombre_pieces_principales,code_nature_culture,nature_culture,code_nature_culture_speciale,nature_culture_speciale,surface_terrain,longitude,latitude
2020-95478,2020-09-25,000001,Vente,1440,,,VERGNES HAMEAU,B012,09100,09255,Saint-Amans,09,,,092550000B0120,,,,,,,,,,,,,0,,,,,P,prés,,,1167,,
2020-95598,2020-10-15,000001,Vente,4000,,,COUDERC,B004,09100,09255,Saint-Amans,09,,,092550000A0309,,,,,,,,,,,,,0,,,,,S,sols,,,22,,
2020-95598,2020-10-15,000001,Vente,4000,,,COUDERC,B004,09100,09255,Saint-Amans,09,,,092550000A0392,,,,,,,,,,,,,0,,,,,S,sols,,,2,,
2020-96339,2020-12-02,000001,Vente,50,,,COUDERC,B004,09100,09255,Saint-Amans,09,,,092550000A0380,,,,,,,,,,,,,0,,,,,S,sols,,,1441,,
2020-96340,2020-12-02,000002,Vente,133000,30,,COUDERC,B004,09100,09255,Saint-Amans,09,,,092550000A0190,,,,,,,,,,,,,0,1,Maison,180,4,S,sols,,,102,,
2020-96340,2020-12-02,000002,Vente,133000,,,COUDERC,B004,09100,09255,Saint-Amans,09,,,092550000A0380,,,,,,,,,,,,,0,,,,,S,sols,,,1441,,
2020-96340,2020-12-02,000002,Vente,133000,,,COUDERC,B004,09100,09255,Saint-Amans,09,,,092550000A0385,,,,,,,,,,,,,0,,,,,S,sols,,,78,,
2020-96340,2020-12-02,000002,Vente,133000,,,COUDERC,B004,09100,09255,Saint-Amans,09,,,092550000A0387,,,,,,,,,,,,,0,,,,,S,sols,,,139,,
2020-96340,2020-12-02,000002,Vente,133000,,,COUDERC,B004,09100,09255,Saint-Amans,09,,,092550000A0388,,,,,,,,,,,,,0,,,,,S,sols,,,94,,
2020-96340,2020-12-02,000002,Vente,133000,,,COUDERC,B004,09100,09255,Saint-Amans,09,,,092550000A0395,,,,,,,,,,,,,0,,,,,T,terres,,,303,,
