id_mutation,date_mutation,numero_disposition,nature_mutation,valeur_fonciere,adresse_numero,adresse_suffixe,adresse_nom_voie,adresse_code_voie,code_postal,code_commune,nom_commune,code_departement,ancien_code_commune,ancien_nom_commune,id_parcelle,ancien_id_parcelle,numero_volume,lot1_numero,lot1_surface_carrez,lot2_numero,lot2_surface_carrez,lot3_numero,lot3_surface_carrez,lot4_numero,lot4_surface_carrez,lot5_numero,lot5_surface_carrez,nombre_lots,code_type_local,type_local,surface_reelle_bati,nombre_pieces_principales,code_nature_culture,nature_culture,code_nature_culture_speciale,nature_culture_speciale,surface_terrain,longitude,latitude
2020-98047,2020-02-12,000001,Vente,3727,,,DARDICOURT,B047,10500,10059,Braux,10,,,10059000ZA0057,,,,,,,,,,,,,0,,,,,BS,taillis sous futaie,,,2260,4.427271,48.475962
2020-98047,2020-02-12,000001,Vente,3727,,,DARDICOURT,B047,10500,10059,Braux,10,,,10059000ZA0059,,,,,,,,,,,,,0,,,,,BS,taillis sous futaie,,,252,4.427622,48.475904
2020-98376,2020-03-09,000001,Vente,100000,,,LA FAUCHEE CARREE,B051,10500,10059,Braux,10,,,10059000ZM0146,,,,,,,,,,,,,0,,,,,T,terres,,,6056,4.473948,48.484228
2020-98376,2020-03-09,000001,Vente,100000,3,,RUE DE LA SOURDINE,0080,10500,10059,Braux,10,,,10059000ZM0147,,,,,,,,,,,,,0,1,Maison,122,4,S,sols,,,1987,4.473608,48.484454
2020-98656,2020-03-20,000001,Vente,60000,18,,RUE DU MOULIN,0060,10500,10059,Braux,10,,,100590000B0653,,,,,,,,,,,,,0,1,Maison,79,2,S,sols,,,1230,4.464744,48.482266
2020-98696,2020-03-06,000002,Echange,849,,,LA SOURDINE,B120,10500,10059,Braux,10,,,10059000ZM0234,,,,,,,,,,,,,0,,,,,S,sols,,,11,4.472882,48.484771
2020-98696,2020-03-06,000002,Echange,849,,,LA SOURDINE,B120,10500,10059,Braux,10,,,10059000ZM0235,,,,,,,,,,,,,0,,,,,S,sols,,,272,4.472935,48.484541
2020-98697,2020-03-06,000003,Echange,6,,,LA SOURDINE,B120,10500,10059,Braux,10,,,10059000ZM0237,,,,,,,,,,,,,0,,,,,S,sols,,,2,4.472973,48.484636
