id_mutation,date_mutation,numero_disposition,nature_mutation,valeur_fonciere,adresse_numero,adresse_suffixe,adresse_nom_voie,adresse_code_voie,code_postal,code_commune,nom_commune,code_departement,ancien_code_commune,ancien_nom_commune,id_parcelle,ancien_id_parcelle,numero_volume,lot1_numero,lot1_surface_carrez,lot2_numero,lot2_surface_carrez,lot3_numero,lot3_surface_carrez,lot4_numero,lot4_surface_carrez,lot5_numero,lot5_surface_carrez,nombre_lots,code_type_local,type_local,surface_reelle_bati,nombre_pieces_principales,code_nature_culture,nature_culture,code_nature_culture_speciale,nature_culture_speciale,surface_terrain,longitude,latitude
2020-97374,2020-01-22,000001,Vente,114000,54,,RUE DE L'EGLISE,0250,10130,10133,Eaux-Puiseaux,10,,,101330000B0716,,,,,,,,,,,,,0,1,Maison,117,5,S,sols,,,684,3.886197,48.117669
2020-98550,2020-03-06,000001,Vente,35200,,,LA VOIE DES PARTS,B073,10130,10133,Eaux-Puiseaux,10,,,101330000A0002,,,,,,,,,,,,,0,,,,,BT,taillis simples,,,1886,3.886303,48.13406
2020-98550,2020-03-06,000001,Vente,35200,,,LE COIN DU GALLOT,B017,10130,10133,Eaux-Puiseaux,10,,,101330000A0223,,,,,,,,,,,,,0,,,,,BT,taillis simples,,,9660,3.900641,48.134375
2020-98643,2020-03-16,000001,Vente,175000,,,HAMEAU D EAUX,B042,10130,10133,Eaux-Puiseaux,10,,,101330000B0533,,,,,,,,,,,,,0,,,,,T,terres,,,90,3.888955,48.122764
2020-98643,2020-03-16,000001,Vente,175000,26,,RUE LARGENTIER,0300,10130,10133,Eaux-Puiseaux,10,,,101330000B0745,,,,,,,,,,,,,0,1,Maison,110,3,S,sols,,,1608,3.889154,48.12282
2020-98643,2020-03-16,000001,Vente,175000,,,HAMEAU D EAUX,B042,10130,10133,Eaux-Puiseaux,10,,,101330000B0748,,,,,,,,,,,,,0,,,,,S,sols,,,423,3.889069,48.122651
2020-99490,2020-05-15,000001,Vente,148500,21,,RUE GRANDE RUE,0290,10130,10133,Eaux-Puiseaux,10,,,101330000B0136,,,,,,,,,,,,,0,1,Maison,81,5,S,sols,,,866,3.890777,48.122198
2020-102968,2020-11-03,000001,Vente,129000,30,,RUE GRANDE RUE,0290,10130,10133,Eaux-Puiseaux,10,,,101330000A0091,,,,,,,,,,,,,0,1,Maison,130,4,S,sols,,,623,3.889068,48.123626
2020-102968,2020-11-03,000001,Vente,129000,,,HAMEAU D EAUX,B042,10130,10133,Eaux-Puiseaux,10,,,101330000A0092,,,,,,,,,,,,,0,,,,,T,terres,,,569,3.889262,48.123617
