id_mutation,date_mutation,numero_disposition,nature_mutation,valeur_fonciere,adresse_numero,adresse_suffixe,adresse_nom_voie,adresse_code_voie,code_postal,code_commune,nom_commune,code_departement,ancien_code_commune,ancien_nom_commune,id_parcelle,ancien_id_parcelle,numero_volume,lot1_numero,lot1_surface_carrez,lot2_numero,lot2_surface_carrez,lot3_numero,lot3_surface_carrez,lot4_numero,lot4_surface_carrez,lot5_numero,lot5_surface_carrez,nombre_lots,code_type_local,type_local,surface_reelle_bati,nombre_pieces_principales,code_nature_culture,nature_culture,code_nature_culture_speciale,nature_culture_speciale,surface_terrain,longitude,latitude
2020-100796,2020-07-24,000001,Vente,10330,,,LE BREUIL,B011,10130,10251,Montigny-les-Monts,10,,,10251000ZB0095,,,,,,,,,,,,,0,,,,,T,terres,,,1033,3.948993,48.10044
2020-100847,2020-07-28,000001,Vente,152500,45,A,LES CHANETS,B032,10130,10251,Montigny-les-Monts,10,,,10251000AD0129,,,,,,,,,,,,,0,1,Maison,92,3,S,sols,,,773,3.953273,48.098128
2020-100847,2020-07-28,000001,Vente,152500,,,LES CHANETS,B032,10130,10251,Montigny-les-Monts,10,,,10251000AD0132,,,,,,,,,,,,,0,,,,,S,sols,,,711,3.953044,48.098327
2020-101150,2020-08-06,000001,Vente,132000,4,,RUE DES CHANETS,0045,10130,10251,Montigny-les-Monts,10,,,102510000C0975,,,,,,,,,,,,,0,1,Maison,88,4,S,sols,,,1126,3.953035,48.097368
2020-101153,2020-08-06,000002,Vente,180000,2,,RUE DU GRAND VERGER,0070,10130,10251,Montigny-les-Monts,10,,,10251000AC0156,,,,,,,,,,,,,0,1,Maison,120,6,S,sols,,,1310,3.95005,48.10191
2020-101153,2020-08-06,000002,Vente,180000,,,LE GRAND VERGER,B050,10130,10251,Montigny-les-Monts,10,,,10251000AC0161,,,,,,,,,,,,,0,,,,,P,prés,,,377,3.94966,48.102187
2020-101153,2020-08-06,000002,Vente,180000,,,LE GRAND VERGER,B050,10130,10251,Montigny-les-Monts,10,,,10251000AC0163,,,,,,,,,,,,,0,,,,,P,prés,,,459,3.949601,48.102245
2020-103429,2020-11-23,000001,Vente,10080,,,LE BREUIL,B011,10130,10251,Montigny-les-Monts,10,,,10251000ZB0096,,,,,,,,,,,,,0,,,,,T,terres,,,1008,3.949486,48.100701
2020-104468,2020-12-28,000001,Vente,60000,22,,RUE DES CLUSEAUX,0055,10130,10251,Montigny-les-Monts,10,,,102510000C0709,,,,,,,,,,,,,0,3,Dépendance,,0,S,sols,,,2072,3.95,48.095788
2020-104468,2020-12-28,000001,Vente,60000,22,,RUE DES CLUSEAUX,0055,10130,10251,Montigny-les-Monts,10,,,102510000C0709,,,,,,,,,,,,,0,1,Maison,200,5,S,sols,,,2072,3.95,48.095788
2020-104468,2020-12-28,000001,Vente,60000,22,,RUE DES CLUSEAUX,0055,10130,10251,Montigny-les-Monts,10,,,102510000C0709,,,,,,,,,,,,,0,3,Dépendance,,0,S,sols,,,2072,3.95,48.095788
2020-104468,2020-12-28,000001,Vente,60000,,,LA DAGOUINE,B046,10130,10251,Montigny-les-Monts,10,,,102510000C0710,,,,,,,,,,,,,0,,,,,T,terres,,,7373,3.949965,48.095402
2020-104468,2020-12-28,000001,Vente,60000,,,LA DAGOUINE,B046,10130,10251,Montigny-les-Monts,10,,,102510000C0711,,,,,,,,,,,,,0,,,,,L,landes,,,4543,3.95095,48.094521
2020-104468,2020-12-28,000001,Vente,60000,,,LA DAGOUINE,B046,10130,10251,Montigny-les-Monts,10,,,102510000C0712,,,,,,,,,,,,,0,,,,,BT,taillis simples,,,1304,3.949831,48.095
