id_mutation,date_mutation,numero_disposition,nature_mutation,valeur_fonciere,adresse_numero,adresse_suffixe,adresse_nom_voie,adresse_code_voie,code_postal,code_commune,nom_commune,code_departement,ancien_code_commune,ancien_nom_commune,id_parcelle,ancien_id_parcelle,numero_volume,lot1_numero,lot1_surface_carrez,lot2_numero,lot2_surface_carrez,lot3_numero,lot3_surface_carrez,lot4_numero,lot4_surface_carrez,lot5_numero,lot5_surface_carrez,nombre_lots,code_type_local,type_local,surface_reelle_bati,nombre_pieces_principales,code_nature_culture,nature_culture,code_nature_culture_speciale,nature_culture_speciale,surface_terrain,longitude,latitude
2020-97853,2020-01-29,000001,Vente,180000,1,,RUE DU 8 MAI 1945,0270,10150,10352,Sainte-Maure,10,,,10352000AI0159,,,,,,,,,,,,,0,1,Maison,101,5,J,jardins,,,849,4.077344,48.334516
2020-97853,2020-01-29,000001,Vente,180000,1,,RUE DU 8 MAI 1945,0270,10150,10352,Sainte-Maure,10,,,10352000AI0159,,,,,,,,,,,,,0,1,Maison,101,5,S,sols,,,500,4.077344,48.334516
2020-97934,2020-02-01,000001,Vente,299200,3,,IMP DES OUCHES,0350,10150,10352,Sainte-Maure,10,,,10352000AI0167,,,,,,,,,,,,,0,1,Maison,192,6,S,sols,,,1010,4.077057,48.333849
2020-97934,2020-02-01,000001,Vente,299200,,,LES OUCHES,B084,10150,10352,Sainte-Maure,10,,,10352000AI0170,,,,,,,,,,,,,0,,,,,S,sols,,,317,4.077747,48.334119
2020-98313,2020-02-24,000001,Vente,13410,,,LES TROPRES,B130,10150,10352,Sainte-Maure,10,,,10352000AH0323,,,,,,,,,,,,,0,,,,,AB,terrains a bâtir,,,447,,
2020-98404,2020-03-13,000001,Vente,211700,20,,RTE DE MERY,0300,10150,10352,Sainte-Maure,10,,,10352000AH0082,,,,,,,,,,,,,0,1,Maison,111,7,J,jardins,,,879,4.075572,48.336001
2020-98404,2020-03-13,000001,Vente,211700,20,,RTE DE MERY,0300,10150,10352,Sainte-Maure,10,,,10352000AH0082,,,,,,,,,,,,,0,1,Maison,111,7,S,sols,,,700,4.075572,48.336001
2020-98430,2020-02-28,000001,Vente,144500,19,,RUE DU HAUT DE VANNES,0260,10150,10352,Sainte-Maure,10,,,10352000AC0052,,,,,,,,,,,,,0,1,Maison,74,4,S,sols,,,562,4.053741,48.358449
2020-98723,2020-04-09,000001,Vente,330000,8,,RUE GALLO ROMAINE,0084,10150,10352,Sainte-Maure,10,,,10352000AE0317,,,,,,,,,,,,,0,1,Maison,144,5,S,sols,,,500,4.071166,48.342086
2020-98723,2020-04-09,000001,Vente,330000,8,,RUE GALLO ROMAINE,0084,10150,10352,Sainte-Maure,10,,,10352000AE0317,,,,,,,,,,,,,0,1,Maison,144,5,AG,terrains d'agrément,,,539,4.071166,48.342086
2020-98730,2020-03-12,000001,Vente,100000,,,LES ACCINS,B001,10150,10352,Sainte-Maure,10,,,10352000AD0155,,,,,,,,,,,,,0,,,,,AB,terrains a bâtir,,,1109,4.063298,48.345104
2020-98931,2020-04-30,000001,Vente,60000,,,LES ACCINS,B001,10150,10352,Sainte-Maure,10,,,10352000AD0174,,,,,,,,,,,,,0,,,,,AB,terrains a bâtir,,,770,4.063731,48.345759
2020-98964,2020-05-07,000001,Vente,177000,24,,RUE AUGUSTE RENOIR,0160,10150,10352,Sainte-Maure,10,,,10352000AE0068,,,,,,,,,,,,,0,1,Maison,114,5,S,sols,,,730,4.069947,48.343926
2020-99465,2020-05-25,000001,Vente,152000,12,,RUE DES SORBIERS,0470,10150,10352,Sainte-Maure,10,,,10352000AE0119,,,,,,,,,,,,,0,1,Maison,72,3,S,sols,,,553,4.069903,48.340561
2020-99548,2020-05-28,000001,Vente,140000,104,,RTE DE MERY,0300,10150,10352,Sainte-Maure,10,,,10352000AD0085,,,,,,,,,,,,,0,4,Local industriel. commercial ou assimilé,154,0,S,sols,,,1582,4.063002,48.344409
2020-99595,2020-05-15,000001,Vente,64000,,,LE BAS DES PERRIERES,B010,10150,10352,Sainte-Maure,10,,,10352000AH0328,,,,,,,,,,,,,0,,,,,AB,terrains a bâtir,,,704,4.07666,48.339904
2020-99595,2020-05-15,000001,Vente,64000,,,LE BAS DES PERRIERES,B010,10150,10352,Sainte-Maure,10,,,10352000AH0367,,,,,,,,,,,,,0,,,,,AB,terrains a bâtir,,,25,4.07682,48.340052
2020-99665,2020-05-26,000001,Vente,158000,9,,RTE DE VERMOISE,0500,10150,10352,Sainte-Maure,10,,,10352000AC0117,,,,,,,,,,,,,0,2,Appartement,100,5,S,sols,,,238,4.049016,48.356074
2020-99665,2020-05-26,000001,Vente,158000,,,VANNES,B135,10150,10352,Sainte-Maure,10,,,10352000AC0121,,,,,,,,,,,,,0,,,,,S,sols,,,20,4.04914,48.356269
2020-99665,2020-05-26,000001,Vente,158000,,,VANNES,B135,10150,10352,Sainte-Maure,10,,,10352000AC0122,,,,,,,,,,,,,0,,,,,S,sols,,,21,4.049176,48.356289
2020-99665,2020-05-26,000001,Vente,158000,,,VANNES,B135,10150,10352,Sainte-Maure,10,,,10352000AC0124,,,,,,,,,,,,,0,,,,,S,sols,,,179,4.049187,48.3562
2020-99665,2020-05-26,000001,Vente,158000,,,VANNES,B135,10150,10352,Sainte-Maure,10,,,10352000AC0133,,,,,,,,,,,,,0,,,,,T,terres,,,73,4.048871,48.355991
2020-99844,2020-05-29,000002,Echange,179437.5,,,LE RION DES BRAS,B120,10150,10352,Sainte-Maure,10,,,10352000ZC0016,,,,,,,,,,,,,0,,,,,T,terres,,,12630,4.082387,48.364625
2020-99844,2020-05-29,000002,Echange,179437.5,,,LES BAS BEAULIEUX,B004,10150,10352,Sainte-Maure,10,,,10352000ZC0046,,,,,,,,,,,,,0,,,,,T,terres,,,29780,4.086081,48.362562
2020-99844,2020-05-29,000002,Echange,179437.5,,,LES BAS BEAULIEUX,B004,10150,10352,Sainte-Maure,10,,,10352000ZC0085,,,,,,,,,,,,,0,,,,,T,terres,,,14740,4.090537,48.363763
2020-99844,2020-05-29,000002,Echange,179437.5,,,LE BAS DES GALLAS,B008,10150,10352,Sainte-Maure,10,,,10352000ZD0010,,,,,,,,,,,,,0,,,,,T,terres,,,13750,4.085574,48.358404
2020-99844,2020-05-29,000002,Echange,179437.5,,,LES BEAULIEUX,B015,10150,10352,Sainte-Maure,10,,,10352000ZO0017,,,,,,,,,,,,,0,,,,,T,terres,,,12205,4.086711,48.367196
2020-99844,2020-05-29,000002,Echange,179437.5,,,LES BEAULIEUX,B015,10150,10352,Sainte-Maure,10,,,10352000ZO0071,,,,,,,,,,,,,0,,,,,T,terres,,,36520,4.095433,48.369873
2020-100009,2020-06-05,000001,Vente,205000,22,,CHE DE MERY,0310,10150,10352,Sainte-Maure,10,,,10352000AC0036,,,,,,,,,,,,,0,1,Maison,100,4,S,sols,,,834,4.051968,48.357265
2020-100598,2020-07-28,000002,Vente,8900,,,PATURE ENTR LES 2 RIVIERES,B148,10150,10352,Sainte-Maure,10,,,10352000ZP0047,,,,,,,,,,,,,0,,,,,BT,taillis simples,,,831,4.065094,48.331268
2020-100718,2020-07-16,000001,Vente,66500,,,LE BAS DES PERRIERES,B010,10150,10352,Sainte-Maure,10,,,10352000AH0331,,,,,,,,,,,,,0,,,,,AB,terrains a bâtir,,,704,4.075869,48.340445
2020-100718,2020-07-16,000001,Vente,66500,,,LE BAS DES PERRIERES,B010,10150,10352,Sainte-Maure,10,,,10352000AH0337,,,,,,,,,,,,,0,,,,,T,terres,,,110,4.076097,48.340587
2020-100828,2020-07-22,000001,Vente,65000,,,LE BAS DES PERRIERES,B010,10150,10352,Sainte-Maure,10,,,10352000AH0334,,,,,,,,,,,,,0,,,,,AB,terrains a bâtir,,,996,4.076042,48.340195
2020-100960,2020-07-21,000001,Vente,68000,,,CHAMPS SAINT PERE,B026,10150,10352,Sainte-Maure,10,,,10352000AE0330,,,,,,,,,,,,,0,,,,,AB,terrains a bâtir,,,955,4.073902,48.340637
2020-101124,2020-08-14,000001,Vente,238000,33,,RUE DU HAUT DE VANNES,0260,10150,10352,Sainte-Maure,10,,,10352000AC0044,,,,,,,,,,,,,0,1,Maison,118,6,S,sols,,,714,4.05146,48.357956
2020-101124,2020-08-14,000001,Vente,238000,,,LE HAUT DE VANNES,B066,10150,10352,Sainte-Maure,10,,,10352000AC0070,,,,,,,,,,,,,0,,,,,S,sols,,,3700,4.052799,48.357973
2020-101124,2020-08-14,000001,Vente,238000,1,X,RUE DU HAUT DE VANNES,0260,10150,10352,Sainte-Maure,10,,,10352000AC0072,,,,,,,,,,,,,0,4,Local industriel. commercial ou assimilé,,0,S,sols,,,28,4.052504,48.357279
2020-101211,2020-08-21,000001,Vente,205000,87,,RTE DE MERY,0300,10150,10352,Sainte-Maure,10,,,10352000AD0104,,,,,,,,,,,,,0,1,Maison,116,6,J,jardins,,,1422,4.062541,48.343218
2020-101211,2020-08-21,000001,Vente,205000,87,,RTE DE MERY,0300,10150,10352,Sainte-Maure,10,,,10352000AD0104,,,,,,,,,,,,,0,1,Maison,116,6,S,sols,,,1000,4.062541,48.343218
2020-101478,2020-08-27,000001,Vente,4500,,,LES OUCHES,B084,10150,10352,Sainte-Maure,10,,,10352000AI0122,,,,,,,,,,,,,0,,,,,S,sols,,,54,4.072728,48.336191
2020-101507,2020-08-27,000001,Vente,66000,,,CHAMPS SAINT PERE,B026,10150,10352,Sainte-Maure,10,,,10352000AE0331,,,,,,,,,,,,,0,,,,,AB,terrains a bâtir,,,904,4.074302,48.340903
2020-101692,2020-09-04,000003,Vente,56000,,,LES TROPRES,B130,10150,10352,Sainte-Maure,10,,,10352000AH0369,,,,,,,,,,,,,0,,,,,AB,terrains a bâtir,,,702,4.077962,48.336126
2020-101723,2020-08-27,000002,Vente,83000,,,VANNES,B135,10150,10352,Sainte-Maure,10,,,10352000AB0119,,,,,,,,,,,,,0,,,,,J,jardins,,,1219,4.047724,48.35999
2020-101991,2020-09-30,000002,Vente,40000,,,LE BAS DES PERRIERES,B010,10150,10352,Sainte-Maure,10,,,10352000AH0269,,,,,,,,,,,,,0,,,,,S,sols,,,164,4.074213,48.336864
2020-101991,2020-09-30,000002,Vente,40000,,,LE BAS DES PERRIERES,B010,10150,10352,Sainte-Maure,10,,,10352000AH0270,,,,,,,,,,,,,0,,,,,T,terres,,,75,4.074053,48.336984
2020-101991,2020-09-30,000002,Vente,40000,,,LE BAS DES PERRIERES,B010,10150,10352,Sainte-Maure,10,,,10352000AH0272,,,,,,,,,,,,,0,,,,,T,terres,,,774,4.074409,48.33681
2020-102205,2020-09-15,000001,Vente,100000,18,,CHE DE MERY,0310,10150,10352,Sainte-Maure,10,,,10352000AC0026,,,,,,,,,,,,,0,1,Maison,145,5,S,sols,,,800,4.05157,48.357165
2020-102205,2020-09-15,000001,Vente,100000,18,,CHE DE MERY,0310,10150,10352,Sainte-Maure,10,,,10352000AC0026,,,,,,,,,,,,,0,1,Maison,145,5,J,jardins,,,997,4.05157,48.357165
2020-102312,2020-09-29,000001,Vente,62000,,,CHAMPS SAINT PERE,B026,10150,10352,Sainte-Maure,10,,,10352000AE0332,,,,,,,,,,,,,0,,,,,AB,terrains a bâtir,,,771,4.074498,48.34107
2020-102396,2020-10-10,000001,Vente,300,,,LE DAVAU,B041,10150,10352,Sainte-Maure,10,,,103520000D0189,,,,,,,,,,,,,0,,,,,VE,vergers,,,1340,4.047646,48.352976
2020-102699,2020-11-04,000001,Vente,59500,,,LES ACCINS,B001,10150,10352,Sainte-Maure,10,,,10352000AD0176,,,,,,,,,,,,,0,,,,,AB,terrains a bâtir,,,700,4.064635,48.346193
2020-102961,2020-10-30,000001,Vente,283000,14,,RUE FLORE THIBAULT,0218,10150,10352,Sainte-Maure,10,,,10352000AH0170,,,,,,,,,,,,,0,1,Maison,120,5,S,sols,,,821,4.074921,48.339047
2020-102969,2020-11-02,000001,Vente,42008.84,,,LE RION DES BRAS,B120,10150,10352,Sainte-Maure,10,,,10352000ZC0016,,,,,,,,,,,,,0,,,,,T,terres,,,12630,4.082387,48.364625
2020-102969,2020-11-02,000001,Vente,42008.84,,,LES BEAULIEUX,B015,10150,10352,Sainte-Maure,10,,,10352000ZO0017,,,,,,,,,,,,,0,,,,,T,terres,,,12205,4.086711,48.367196
2020-102971,2020-11-02,000001,Vente,61774.22,,,LES BEAULIEUX,B015,10150,10352,Sainte-Maure,10,,,10352000ZO0071,,,,,,,,,,,,,0,,,,,T,terres,,,36520,4.095433,48.369873
2020-103159,2020-11-03,000001,Vente,201000,17,,RUE DU 8 MAI 1945,0270,10150,10352,Sainte-Maure,10,,,10352000AI0057,,,,,,,,,,,,,0,1,Maison,123,5,S,sols,,,526,4.07535,48.333218
2020-103340,2020-11-20,000001,Vente,168000,19,,RUE DU 8 MAI 1945,0270,10150,10352,Sainte-Maure,10,,,10352000AI0058,,,,,,,,,,,,,0,1,Maison,73,4,S,sols,,,456,4.07519,48.33307
2020-103452,2020-11-24,000001,Vente,2700,,,LES GALLAS,B057,10150,10352,Sainte-Maure,10,,,10352000ZD0037,,,,,,,,,,,,,0,,,,,VI,vignes,,,970,4.088919,48.354915
2020-103954,2020-12-14,000001,Vente,70000,,,LE BAS DES PERRIERES,B010,10150,10352,Sainte-Maure,10,,,10352000AH0336,,,,,,,,,,,,,0,,,,,AB,terrains a bâtir,,,996,4.07635,48.339968
2020-104084,2020-12-14,000001,Vente,174850,84,,RTE DE MERY,0300,10150,10352,Sainte-Maure,10,,,10352000AE0083,,,,,,,,,,,,,0,1,Maison,100,4,S,sols,,,696,4.066701,48.342509
2020-104084,2020-12-14,000001,Vente,174850,84,,RTE DE MERY,0300,10150,10352,Sainte-Maure,10,,,10352000AE0083,,,,,,,,,,,,,0,3,Dépendance,,0,S,sols,,,696,4.066701,48.342509
2020-104154,2020-12-18,000001,Vente,299000,128,,RTE DE MERY,0300,10150,10352,Sainte-Maure,10,,,10352000AD0186,,,,,,,,,,,,,0,3,Dépendance,,0,S,sols,,,1469,4.059275,48.346831
2020-104154,2020-12-18,000001,Vente,299000,128,,RTE DE MERY,0300,10150,10352,Sainte-Maure,10,,,10352000AD0186,,,,,,,,,,,,,0,3,Dépendance,,0,S,sols,,,1469,4.059275,48.346831
2020-104154,2020-12-18,000001,Vente,299000,128,,RTE DE MERY,0300,10150,10352,Sainte-Maure,10,,,10352000AD0186,,,,,,,,,,,,,0,1,Maison,194,6,S,sols,,,1469,4.059275,48.346831
2020-104180,2020-12-23,000001,Vente,40000,,,LES OUCHES,B084,10150,10352,Sainte-Maure,10,,,10352000AI0123,,,,,,,,,,,,,0,,,,,T,terres,,,410,4.072758,48.336334
