id_mutation,date_mutation,numero_disposition,nature_mutation,valeur_fonciere,adresse_numero,adresse_suffixe,adresse_nom_voie,adresse_code_voie,code_postal,code_commune,nom_commune,code_departement,ancien_code_commune,ancien_nom_commune,id_parcelle,ancien_id_parcelle,numero_volume,lot1_numero,lot1_surface_carrez,lot2_numero,lot2_surface_carrez,lot3_numero,lot3_surface_carrez,lot4_numero,lot4_surface_carrez,lot5_numero,lot5_surface_carrez,nombre_lots,code_type_local,type_local,surface_reelle_bati,nombre_pieces_principales,code_nature_culture,nature_culture,code_nature_culture_speciale,nature_culture_speciale,surface_terrain,longitude,latitude
2020-97360,2020-01-24,000001,Vente,70000,69,,RUE DE LA GARE,0310,10370,10420,Villenauxe-la-Grande,10,,,10420000AK0184,,,,,,,,,,,,,0,1,Maison,70,2,S,sols,,,326,3.557146,48.588501
2020-97360,2020-01-24,000001,Vente,70000,69,,RUE DE LA GARE,0310,10370,10420,Villenauxe-la-Grande,10,,,10420000AK0192,,,,,,,,,,,,,0,,,,,J,jardins,POTAG,Jardin potager,1016,3.557016,48.588152
2020-97373,2020-01-17,000001,Vente,92000,14,,RUE D'ESTERNAY,0200,10370,10420,Villenauxe-la-Grande,10,,,10420000AC0136,,,,,,,,,,,,,0,1,Maison,74,3,J,jardins,POTAG,Jardin potager,931,3.558382,48.596448
2020-97373,2020-01-17,000001,Vente,92000,14,,RUE D'ESTERNAY,0200,10370,10420,Villenauxe-la-Grande,10,,,10420000AC0136,,,,,,,,,,,,,0,1,Maison,74,3,S,sols,,,593,3.558382,48.596448
2020-97649,2020-02-08,000001,Vente,55000,6,,RUE DES CHENETS,0122,10370,10420,Villenauxe-la-Grande,10,,,10420000AD0208,,,,,,,,,,,,,0,1,Maison,61,3,S,sols,,,293,3.556873,48.591272
2020-97699,2020-01-24,000001,Vente,85000,128,,RUE DU PERREY,0641,10370,10420,Villenauxe-la-Grande,10,,,10420000AB0163,,,,,,,,,,,,,0,1,Maison,84,4,S,sols,,,315,3.556349,48.595273
2020-97708,2020-02-11,000001,Vente,81000,24,,RUE DES GODURES,0337,10370,10420,Villenauxe-la-Grande,10,,,10420000AA0347,,,,,,,,,,,,,0,1,Maison,80,4,S,sols,,,289,3.557853,48.601063
2020-97734,2020-01-30,000001,Vente,5200,,,LES MAZOTS,B089,10370,10420,Villenauxe-la-Grande,10,,,104200000A0109,,,,,,,,,,,,,0,,,,,T,terres,,,5488,3.562739,48.608331
2020-97734,2020-01-30,000001,Vente,5200,,,LES MAZOTS,B089,10370,10420,Villenauxe-la-Grande,10,,,104200000A0110,,,,,,,,,,,,,0,,,,,BT,taillis simples,,,1214,3.562054,48.608464
2020-97734,2020-01-30,000001,Vente,5200,,,FONTAINE FONDUE,B053,10370,10420,Villenauxe-la-Grande,10,,,104200000A0340,,,,,,,,,,,,,0,,,,,BT,taillis simples,,,268,3.561764,48.606753
2020-97734,2020-01-30,000001,Vente,5200,,,FONTAINE FONDUE,B053,10370,10420,Villenauxe-la-Grande,10,,,104200000A0341,,,,,,,,,,,,,0,,,,,S,sols,,,1491,3.561823,48.606829
2020-97734,2020-01-30,000001,Vente,5200,,,FONTAINE FONDUE,B053,10370,10420,Villenauxe-la-Grande,10,,,104200000A0342,,,,,,,,,,,,,0,,,,,BT,taillis simples,,,1039,3.561248,48.607151
2020-97864,2020-01-31,000001,Vente,60000,25,,RUE BECHERET,0060,10370,10420,Villenauxe-la-Grande,10,,,10420000AK0072,,,,,,,,,,,,,0,1,Maison,85,3,S,sols,,,471,3.551189,48.588605
2020-97866,2020-02-07,000001,Vente,1200,,,LES PIERRES A VIN,B115,10370,10420,Villenauxe-la-Grande,10,,,10420000ZK0024,,,,,,,,,,,,,0,,,,,VE,vergers,,,447,3.555056,48.603531
2020-97870,2020-02-07,000001,Vente,110000,5,,RUE DE L ARBOUIN,0030,10370,10420,Villenauxe-la-Grande,10,,,10420000AA0170,,,,,,,,,,,,,0,1,Maison,100,6,J,jardins,POTAG,Jardin potager,765,3.557179,48.602084
2020-97870,2020-02-07,000001,Vente,110000,5,,RUE DE L ARBOUIN,0030,10370,10420,Villenauxe-la-Grande,10,,,10420000AA0170,,,,,,,,,,,,,0,1,Maison,100,6,S,sols,,,600,3.557179,48.602084
2020-97870,2020-02-07,000001,Vente,110000,4,B,RUE DE L ARBOUIN,0030,10370,10420,Villenauxe-la-Grande,10,,,10420000AA0184,,,,,,,,,,,,,0,3,Dépendance,,0,S,sols,,,122,3.556786,48.601882
2020-97902,2020-02-05,000001,Vente,82000,,,LA GLACIERE,B061,10370,10420,Villenauxe-la-Grande,10,,,10420000ZN0052,,,,,,,,,,,,,0,,,,,T,terres,,,10595,3.559788,48.580434
2020-97902,2020-02-05,000001,Vente,82000,,,LA GLACIERE,B061,10370,10420,Villenauxe-la-Grande,10,,,10420000ZN0052,,,,,,,,,,,,,0,,,,,T,terres,,,10595,3.559788,48.580434
2020-97902,2020-02-05,000001,Vente,82000,,,LA GARENNE,B058,10370,10420,Villenauxe-la-Grande,10,,,10420000ZO0007,,,,,,,,,,,,,0,,,,,T,terres,,,29290,3.554905,48.576922
2020-97902,2020-02-05,000001,Vente,82000,,,LE CHEMIN PERREY,B031,10370,10420,Villenauxe-la-Grande,10,,,10420000ZP0030,,,,,,,,,,,,,0,,,,,T,terres,,,11850,3.54031,48.578274
2020-97902,2020-02-05,000001,Vente,82000,,,LE BAS DES LONGUANTES,B006,10370,10420,Villenauxe-la-Grande,10,,,10420000ZR0093,,,,,,,,,,,,,0,,,,,T,terres,,,11540,3.540609,48.586161
2020-98044,2020-02-14,000001,Vente,5000,,,LES FOLIES,B051,10370,10420,Villenauxe-la-Grande,10,,,10420000ZM0038,,,,,,,,,,,,,0,,,,,T,terres,,,1420,3.566535,48.589366
2020-98164,2020-02-07,000001,Vente,127000,41,,RUE GDE RUE MONTROBERT,0586,10370,10420,Villenauxe-la-Grande,10,,,10420000AA0115,,,,,,,,,,,,,0,1,Maison,99,4,S,sols,,,517,3.553337,48.601446
2020-98323,2020-03-06,000001,Vente,115000,2,,RUE DE PLANTEFAUX,0655,10370,10420,Villenauxe-la-Grande,10,,,10420000AE0117,,,,,,,,,,,,,0,1,Maison,140,5,S,sols,,,778,3.560964,48.591956
2020-98489,2020-03-10,000001,Vente,50000,1,,RUE DE LA GARE,0310,10370,10420,Villenauxe-la-Grande,10,,,10420000AK0117,,,,,,,,,,,,,0,1,Maison,90,4,S,sols,,,173,3.555129,48.589424
2020-98489,2020-03-10,000001,Vente,50000,1,,RUE DE LA GARE,0310,10370,10420,Villenauxe-la-Grande,10,,,10420000AK0117,,,,,,,,,,,,,0,4,Local industriel. commercial ou assimilé,88,0,S,sols,,,173,3.555129,48.589424
2020-98508,2020-03-13,000001,Vente,62000,9,,RUE DES FRERES ROBERT,0290,10370,10420,Villenauxe-la-Grande,10,,,10420000AD0028,,,,,,,,,,,,,0,1,Maison,67,4,S,sols,,,156,3.55483,48.590677
2020-98649,2020-03-28,000001,Vente,125000,813,,LES PENDANTS,B110,10370,10420,Villenauxe-la-Grande,10,,,10420000AB0035,,,,,,,,,,,,,0,3,Dépendance,,0,VE,vergers,,,200,3.55326,48.592873
2020-98649,2020-03-28,000001,Vente,125000,,,RUE DU CHATEAU,0119,10370,10420,Villenauxe-la-Grande,10,,,10420000AK0157,,,,,,,,,,,,,0,,,,,S,sols,,,154,3.555152,48.588955
2020-98649,2020-03-28,000001,Vente,125000,16,,RUE DU CHATEAU,0119,10370,10420,Villenauxe-la-Grande,10,,,10420000AK0449,,,,,,,,,,,,,0,1,Maison,93,7,S,sols,,,139,3.554986,48.588915
2020-98649,2020-03-28,000001,Vente,125000,16,B,RUE DU CHATEAU,0119,10370,10420,Villenauxe-la-Grande,10,,,10420000AK0450,,,1,,,,,,,,,,1,3,Dépendance,,0,,,,,,3.555159,48.588894
2020-98690,2020-04-02,000001,Vente,7000,69,,RUE DE LA GARE,0310,10370,10420,Villenauxe-la-Grande,10,,,10420000AK0192,,,,,,,,,,,,,0,,,,,J,jardins,POTAG,Jardin potager,1016,3.557016,48.588152
2020-98793,2020-04-15,000001,Vente,52000,13,,RUE MONTROBERT,0585,10370,10420,Villenauxe-la-Grande,10,,,10420000AB0077,,,,,,,,,,,,,0,1,Maison,47,3,S,sols,,,264,3.55409,48.59827
2020-98793,2020-04-15,000001,Vente,52000,,,LES TRAVERS,B189,10370,10420,Villenauxe-la-Grande,10,,,10420000AB0079,,,,,,,,,,,,,0,,,,,J,jardins,POTAG,Jardin potager,481,3.554285,48.598039
2020-98836,2020-04-17,000001,Vente,100000,33,,RUE DES CHENETS,0122,10370,10420,Villenauxe-la-Grande,10,,,10420000AD0229,,,,,,,,,,,,,0,1,Maison,80,3,S,sols,,,116,3.557387,48.590954
2020-98836,2020-04-17,000001,Vente,100000,25,T,RUE DES CHENETS,0122,10370,10420,Villenauxe-la-Grande,10,,,10420000AD0234,,,,,,,,,,,,,0,3,Dépendance,,0,S,sols,,,89,3.55725,48.590804
2020-98901,2020-04-10,000001,Vente,117000,12,,RUE DU PERREY,0641,10370,10420,Villenauxe-la-Grande,10,,,10420000AD0049,,,,,,,,,,,,,0,1,Maison,69,5,S,sols,,,160,3.555048,48.590752
2020-98975,2020-04-23,000001,Vente,7593,,,MONTRE,B099,10370,10420,Villenauxe-la-Grande,10,,,10420000ZA0018,,,,,,,,,,,,,0,,,,,T,terres,,,18060,3.525696,48.58941
2020-98975,2020-04-23,000001,Vente,7593,,,MONTRE,B099,10370,10420,Villenauxe-la-Grande,10,,,10420000ZA0018,,,,,,,,,,,,,0,,,,,BT,taillis simples,,,2110,3.525696,48.58941
2020-99047,2020-05-07,000001,Vente,26000,,,AV DE LA GARE,0311,10370,10420,Villenauxe-la-Grande,10,,,10420000AE0076,,,,,,,,,,,,,0,,,,,J,jardins,POTAG,Jardin potager,469,3.561871,48.589267
2020-99047,2020-05-07,000001,Vente,26000,,,RUE DENIS PAPIN,0160,10370,10420,Villenauxe-la-Grande,10,,,10420000AE0077,,,,,,,,,,,,,0,,,,,VE,vergers,,,500,3.561774,48.589366
2020-99565,2020-05-29,000001,Vente,80000,41,,RUE DES GODURES,0337,10370,10420,Villenauxe-la-Grande,10,,,10420000AA0337,,,,,,,,,,,,,0,1,Maison,80,4,S,sols,,,255,3.558848,48.601349
2020-99664,2020-05-28,000001,Vente,79000,63,,RUE DE LA GARE,0310,10370,10420,Villenauxe-la-Grande,10,,,10420000AK0177,,,,,,,,,,,,,0,1,Maison,47,3,S,sols,,,47,3.557013,48.588774
2020-99664,2020-05-28,000001,Vente,79000,,,RUE DE LA GARE,0310,10370,10420,Villenauxe-la-Grande,10,,,10420000AK0178,,,,,,,,,,,,,0,,,,,S,sols,,,240,3.556839,48.588794
2020-99674,2020-05-20,000001,Vente,183701,,,COTE DE REIMS,B036,10370,10420,Villenauxe-la-Grande,10,,,104200000A0383,,,,,,,,,,,,,0,,,,,VI,vignes,VAOC,Vins d'appellation d'origine contrôlée,616,3.557321,48.604306
2020-99674,2020-05-20,000001,Vente,183701,,,COTE DE REIMS,B036,10370,10420,Villenauxe-la-Grande,10,,,104200000A0384,,,,,,,,,,,,,0,,,,,VI,vignes,VAOC,Vins d'appellation d'origine contrôlée,333,3.557251,48.604246
2020-99674,2020-05-20,000001,Vente,183701,,,LONGUERATTES,B084,10370,10420,Villenauxe-la-Grande,10,,,104200000A0744,,,,,,,,,,,,,0,,,,,VI,vignes,VAOC,Vins d'appellation d'origine contrôlée,113,3.551135,48.60168
2020-99674,2020-05-20,000001,Vente,183701,,,LONGUERATTES,B084,10370,10420,Villenauxe-la-Grande,10,,,104200000A0745,,,,,,,,,,,,,0,,,,,VI,vignes,VAOC,Vins d'appellation d'origine contrôlée,149,3.550856,48.60172
2020-99674,2020-05-20,000001,Vente,183701,,,LONGUERATTES,B084,10370,10420,Villenauxe-la-Grande,10,,,104200000A0853,,,,,,,,,,,,,0,,,,,VI,vignes,VAOC,Vins d'appellation d'origine contrôlée,2,3.550409,48.601885
2020-99674,2020-05-20,000001,Vente,183701,,,LONGUERATTES,B084,10370,10420,Villenauxe-la-Grande,10,,,104200000A0857,,,,,,,,,,,,,0,,,,,VI,vignes,VAOC,Vins d'appellation d'origine contrôlée,607,3.550625,48.601902
2020-99674,2020-05-20,000001,Vente,183701,,,LONGUERATTES,B084,10370,10420,Villenauxe-la-Grande,10,,,104200000A0858,,,,,,,,,,,,,0,,,,,VI,vignes,VAOC,Vins d'appellation d'origine contrôlée,668,3.550905,48.601812
2020-99674,2020-05-20,000001,Vente,183701,,,LONGUERATTES,B084,10370,10420,Villenauxe-la-Grande,10,,,104200000A0861,,,,,,,,,,,,,0,,,,,VI,vignes,VAOC,Vins d'appellation d'origine contrôlée,43,3.550555,48.601885
2020-99674,2020-05-20,000001,Vente,183701,,,LONGUERATTES,B084,10370,10420,Villenauxe-la-Grande,10,,,104200000A0890,,,,,,,,,,,,,0,,,,,VI,vignes,VAOC,Vins d'appellation d'origine contrôlée,155,3.550968,48.601663
2020-100309,2020-06-16,000001,Vente,85000,,,RUE DU MAROIS,0545,10370,10420,Villenauxe-la-Grande,10,,,10420000AK0303,,,,,,,,,,,,,0,,,,,J,jardins,POTAG,Jardin potager,549,3.553801,48.587713
2020-100309,2020-06-16,000001,Vente,85000,10,,RUE DU MAROIS,0545,10370,10420,Villenauxe-la-Grande,10,,,10420000AK0306,,,,,,,,,,,,,0,1,Maison,90,4,S,sols,,,358,3.553386,48.587688
2020-100438,2020-07-23,000001,Vente,157000,,,RUE GDE RUE MONTROBERT,0586,10370,10420,Villenauxe-la-Grande,10,,,10420000AA0112,,,,,,,,,,,,,0,,,,,J,jardins,POTAG,Jardin potager,642,3.554277,48.601143
2020-100438,2020-07-23,000001,Vente,157000,46,,RUE GDE RUE MONTROBERT,0586,10370,10420,Villenauxe-la-Grande,10,,,10420000AA0114,,,,,,,,,,,,,0,2,Appartement,95,4,S,sols,,,373,3.553942,48.60125
2020-100438,2020-07-23,000001,Vente,157000,46,,RUE GDE RUE MONTROBERT,0586,10370,10420,Villenauxe-la-Grande,10,,,10420000AA0114,,,,,,,,,,,,,0,2,Appartement,50,4,S,sols,,,373,3.553942,48.60125
2020-100898,2020-07-31,000001,Vente,71000,22,,RUE DE LA GARE,0310,10370,10420,Villenauxe-la-Grande,10,,,10420000AD0371,,,,,,,,,,,,,0,2,Appartement,41,3,S,sols,,,182,3.555895,48.589669
2020-100898,2020-07-31,000001,Vente,71000,22,,RUE DE LA GARE,0310,10370,10420,Villenauxe-la-Grande,10,,,10420000AD0371,,,,,,,,,,,,,0,2,Appartement,36,3,S,sols,,,182,3.555895,48.589669
2020-100898,2020-07-31,000001,Vente,71000,22,,RUE DE LA GARE,0310,10370,10420,Villenauxe-la-Grande,10,,,10420000AD0371,,,,,,,,,,,,,0,2,Appartement,41,3,S,sols,,,182,3.555895,48.589669
2020-100931,2020-08-04,000001,Vente,80000,19,,PL GEORGES CLEMENCEAU,0330,10370,10420,Villenauxe-la-Grande,10,,,10420000AK0114,,,,,,,,,,,,,0,1,Maison,105,3,S,sols,,,217,3.554508,48.589407
2020-100931,2020-08-04,000001,Vente,80000,19,,PL GEORGES CLEMENCEAU,0330,10370,10420,Villenauxe-la-Grande,10,,,10420000AK0114,,,,,,,,,,,,,0,4,Local industriel. commercial ou assimilé,95,0,S,sols,,,217,3.554508,48.589407
2020-101224,2020-08-11,000001,Vente,150000,4,,RLE FARIAT,0261,10370,10420,Villenauxe-la-Grande,10,,,10420000AK0205,,,,,,,,,,,,,0,1,Maison,75,5,J,jardins,POTAG,Jardin potager,829,3.555664,48.587263
2020-101224,2020-08-11,000001,Vente,150000,4,,RLE FARIAT,0261,10370,10420,Villenauxe-la-Grande,10,,,10420000AK0205,,,,,,,,,,,,,0,1,Maison,75,5,VE,vergers,,,813,3.555664,48.587263
2020-101224,2020-08-11,000001,Vente,150000,4,,RLE FARIAT,0261,10370,10420,Villenauxe-la-Grande,10,,,10420000AK0205,,,,,,,,,,,,,0,1,Maison,75,5,VI,vignes,,,725,3.555664,48.587263
2020-101224,2020-08-11,000001,Vente,150000,4,,RLE FARIAT,0261,10370,10420,Villenauxe-la-Grande,10,,,10420000AK0205,,,,,,,,,,,,,0,1,Maison,75,5,S,sols,,,921,3.555664,48.587263
2020-101696,2020-09-10,000001,Vente,20000,44,,RUE DU CHATEAU,0119,10370,10420,Villenauxe-la-Grande,10,,,10420000AK0219,,,,,,,,,,,,,0,1,Maison,59,2,S,sols,,,251,3.55502,48.587607
2020-101707,2020-09-12,000001,Vente,50000,5,,RUE DE PRESLE,0673,10370,10420,Villenauxe-la-Grande,10,,,10420000AL0086,,,,,,,,,,,,,0,3,Dépendance,,0,J,jardins,MARAI,Pré marais,770,3.552448,48.590993
2020-101707,2020-09-12,000001,Vente,50000,7,,RUE DE PRESLE,0673,10370,10420,Villenauxe-la-Grande,10,,,10420000AL0087,,,,,,,,,,,,,0,3,Dépendance,,0,VE,vergers,,,807,3.552174,48.590896
2020-101806,2020-09-16,000001,Vente,165000,67,,RUE DU PERREY,0641,10370,10420,Villenauxe-la-Grande,10,,,10420000AD0183,,,,,,,,,,,,,0,1,Maison,58,2,J,jardins,POTAG,Jardin potager,516,3.556821,48.592811
2020-101806,2020-09-16,000001,Vente,165000,67,,RUE DU PERREY,0641,10370,10420,Villenauxe-la-Grande,10,,,10420000AD0183,,,,,,,,,,,,,0,1,Maison,58,2,VE,vergers,,,320,3.556821,48.592811
2020-101806,2020-09-16,000001,Vente,165000,67,,RUE DU PERREY,0641,10370,10420,Villenauxe-la-Grande,10,,,10420000AD0183,,,,,,,,,,,,,0,1,Maison,58,2,S,sols,,,438,3.556821,48.592811
2020-101810,2020-09-22,000001,Vente,7000,,,LES TRAVERS,B189,10370,10420,Villenauxe-la-Grande,10,,,10420000AB0087,,,,,,,,,,,,,0,,,,,VE,vergers,,,881,3.554269,48.597561
2020-102054,2020-09-24,000001,Vente,2793,,,LA GRANGE PIERRE,B073,10370,10420,Villenauxe-la-Grande,10,,,104200000A0035,,,,,,,,,,,,,0,,,,,BS,taillis sous futaie,,,1144,3.545681,48.606831
2020-102054,2020-09-24,000001,Vente,2793,,,LA GRANGE PIERRE,B073,10370,10420,Villenauxe-la-Grande,10,,,104200000A0036,,,,,,,,,,,,,0,,,,,BS,taillis sous futaie,,,1040,3.54573,48.60701
2020-102054,2020-09-24,000001,Vente,2793,,,LE DELUGE,B042,10370,10420,Villenauxe-la-Grande,10,,,104200000G0030,,,,,,,,,,,,,0,,,,,BT,taillis simples,,,979,3.531096,48.590205
2020-102054,2020-09-24,000001,Vente,2793,,,LES PETITS SABLONS,B113,10370,10420,Villenauxe-la-Grande,10,,,104200000G0504,,,,,,,,,,,,,0,,,,,BT,taillis simples,,,1476,3.531483,48.583681
2020-102054,2020-09-24,000001,Vente,2793,,,LES PETITS SABLONS,B113,10370,10420,Villenauxe-la-Grande,10,,,104200000G0559,,,,,,,,,,,,,0,,,,,BT,taillis simples,,,48,3.532079,48.583668
2020-102054,2020-09-24,000001,Vente,2793,,,LES PETITS SABLONS,B113,10370,10420,Villenauxe-la-Grande,10,,,104200000G0560,,,,,,,,,,,,,0,,,,,BT,taillis simples,,,567,3.531633,48.583597
2020-102056,2020-09-24,000001,Vente,2954,,,LES PETITS SABLONS,B113,10370,10420,Villenauxe-la-Grande,10,,,104200000G0506,,,,,,,,,,,,,0,,,,,BT,taillis simples,,,1292,3.530655,48.583449
2020-102207,2020-09-29,000001,Vente,55500,15,,RUE DU CHATEAU,0119,10370,10420,Villenauxe-la-Grande,10,,,10420000AK0282,,,,,,,,,,,,,0,1,Maison,72,3,S,sols,,,183,3.554521,48.58896
2020-102365,2020-10-09,000001,Vente,7500,,,LES FAUX BORDS,B048,10370,10420,Villenauxe-la-Grande,10,,,104200000A0622,,,,,,,,,,,,,0,,,,,VE,vergers,,,352,3.552792,48.602253
2020-102365,2020-10-09,000001,Vente,7500,633,,LES FAUX BORDS,B048,10370,10420,Villenauxe-la-Grande,10,,,104200000A0623,,,,,,,,,,,,,0,1,Maison,20,1,S,sols,,,79,3.552411,48.602203
2020-102365,2020-10-09,000001,Vente,7500,,,LES FAUX BORDS,B048,10370,10420,Villenauxe-la-Grande,10,,,104200000A0624,,,,,,,,,,,,,0,,,,,VE,vergers,,,357,3.552709,48.602194
2020-102381,2020-09-25,000001,Vente,75500,1,B,RUE DES FRERES ROBERT,0290,10370,10420,Villenauxe-la-Grande,10,,,10420000AD0032,,,,,,,,,,,,,0,3,Dépendance,,0,S,sols,,,138,3.554514,48.590414
2020-102381,2020-09-25,000001,Vente,75500,7,,RUE SAINT ROCH,0697,10370,10420,Villenauxe-la-Grande,10,,,10420000AD0037,,,,,,,,,,,,,0,1,Maison,46,3,S,sols,,,56,3.554509,48.590278
2020-102381,2020-09-25,000001,Vente,75500,,,RUE DES FRERES ROBERT,0290,10370,10420,Villenauxe-la-Grande,10,,,10420000AD0448,,,,,,,,,,,,,0,,,,,S,sols,,,20,3.554599,48.590373
2020-102399,2020-10-16,000001,Vente,270000,73,,RUE DE LA GARE,0310,10370,10420,Villenauxe-la-Grande,10,,,10420000AK0186,,,,,,,,,,,,,0,2,Appartement,89,4,S,sols,,,500,3.557394,48.588372
2020-102399,2020-10-16,000001,Vente,270000,73,,RUE DE LA GARE,0310,10370,10420,Villenauxe-la-Grande,10,,,10420000AK0186,,,,,,,,,,,,,0,2,Appartement,66,4,VE,vergers,,,625,3.557394,48.588372
2020-102399,2020-10-16,000001,Vente,270000,73,,RUE DE LA GARE,0310,10370,10420,Villenauxe-la-Grande,10,,,10420000AK0186,,,,,,,,,,,,,0,2,Appartement,30,1,VE,vergers,,,625,3.557394,48.588372
2020-102399,2020-10-16,000001,Vente,270000,73,,RUE DE LA GARE,0310,10370,10420,Villenauxe-la-Grande,10,,,10420000AK0186,,,,,,,,,,,,,0,2,Appartement,61,3,VE,vergers,,,625,3.557394,48.588372
2020-102399,2020-10-16,000001,Vente,270000,73,,RUE DE LA GARE,0310,10370,10420,Villenauxe-la-Grande,10,,,10420000AK0186,,,,,,,,,,,,,0,2,Appartement,75,4,VE,vergers,,,625,3.557394,48.588372
2020-102399,2020-10-16,000001,Vente,270000,73,,RUE DE LA GARE,0310,10370,10420,Villenauxe-la-Grande,10,,,10420000AK0186,,,,,,,,,,,,,0,2,Appartement,89,4,VE,vergers,,,625,3.557394,48.588372
2020-102399,2020-10-16,000001,Vente,270000,73,,RUE DE LA GARE,0310,10370,10420,Villenauxe-la-Grande,10,,,10420000AK0186,,,,,,,,,,,,,0,2,Appartement,61,3,S,sols,,,500,3.557394,48.588372
2020-102399,2020-10-16,000001,Vente,270000,73,,RUE DE LA GARE,0310,10370,10420,Villenauxe-la-Grande,10,,,10420000AK0186,,,,,,,,,,,,,0,2,Appartement,66,4,S,sols,,,500,3.557394,48.588372
2020-102399,2020-10-16,000001,Vente,270000,73,,RUE DE LA GARE,0310,10370,10420,Villenauxe-la-Grande,10,,,10420000AK0186,,,,,,,,,,,,,0,2,Appartement,30,1,S,sols,,,500,3.557394,48.588372
2020-102399,2020-10-16,000001,Vente,270000,73,,RUE DE LA GARE,0310,10370,10420,Villenauxe-la-Grande,10,,,10420000AK0186,,,,,,,,,,,,,0,2,Appartement,75,4,S,sols,,,500,3.557394,48.588372
2020-102399,2020-10-16,000001,Vente,270000,73,,RUE DE LA GARE,0310,10370,10420,Villenauxe-la-Grande,10,,,10420000AK0191,,,,,,,,,,,,,0,,,,,J,jardins,POTAG,Jardin potager,1066,3.557302,48.587867
2020-102402,2020-10-20,000001,Vente,215000,6,B,RUE DES TRYOLITS,0713,10370,10420,Villenauxe-la-Grande,10,,,10420000AH0113,,,,,,,,,,,,,0,3,Dépendance,,0,J,jardins,POTAG,Jardin potager,679,3.557197,48.585084
2020-102402,2020-10-20,000001,Vente,215000,6,B,RUE DES TRYOLITS,0713,10370,10420,Villenauxe-la-Grande,10,,,10420000AH0114,,,,,,,,,,,,,0,1,Maison,81,4,S,sols,,,837,3.557357,48.585201
2020-102402,2020-10-20,000001,Vente,215000,,,RUE DES TRYOLITS,0713,10370,10420,Villenauxe-la-Grande,10,,,10420000AH0115,,,,,,,,,,,,,0,,,,,J,jardins,POTAG,Jardin potager,557,3.557229,48.585435
2020-102556,2020-10-16,000001,Vente,230000,1,,RUE DE LA BRUICHE,0092,10370,10420,Villenauxe-la-Grande,10,,,10420000AH0129,,,,,,,,,,,,,0,1,Maison,154,5,S,sols,,,783,3.55953,48.586307
2020-103300,2020-11-18,000001,Vente,10000,4,,RLE DU SAC,0702,10370,10420,Villenauxe-la-Grande,10,,,10420000AD0430,,,,,,,,,,,,,0,3,Dépendance,,0,S,sols,,,66,3.554514,48.591282
2020-103644,2020-12-15,000001,Vente,135000,5,,RUE DU CLOS DES VIGNES,0100,10370,10420,Villenauxe-la-Grande,10,,,10420000AH0156,,,,,,,,,,,,,0,1,Maison,81,4,S,sols,,,540,3.56237,48.587202
2020-103743,2020-12-09,000001,Vente,235000,11,,RUE DU CHATEAU,0119,10370,10420,Villenauxe-la-Grande,10,,,10420000AK0284,,,,,,,,,,,,,0,1,Maison,139,5,S,sols,,,295,3.554597,48.589119
2020-104145,2020-12-15,000001,Vente,11720,,,LA VERNISOLE,B193,10370,10420,Villenauxe-la-Grande,10,,,10420000ZR0213,,,,,,,,,,,,,0,,,,,J,jardins,POTAG,Jardin potager,876,3.544192,48.588284
2020-104145,2020-12-15,000001,Vente,11720,,,LA VERNISOLE,B193,10370,10420,Villenauxe-la-Grande,10,,,10420000ZR0214,,,,,,,,,,,,,0,,,,,VE,vergers,,,296,3.544045,48.58817
2020-104293,2020-12-18,000001,Vente,145000,17,,RUE DU MAROIS,0545,10370,10420,Villenauxe-la-Grande,10,,,10420000AK0331,,,,,,,,,,,,,0,3,Dépendance,,0,S,sols,,,278,3.552891,48.587824
2020-104293,2020-12-18,000001,Vente,145000,17,,RUE DU MAROIS,0545,10370,10420,Villenauxe-la-Grande,10,,,10420000AK0331,,,,,,,,,,,,,0,1,Maison,91,4,S,sols,,,278,3.552891,48.587824
